{"text_format":"1","workbook":"xlsx","n_sheets":8,"sheets":["シート構成","sheet説明⇒【☆】Vsoil算出計算","☆","単軸三角形配置","単軸四角形配置","二軸四角配置","二軸千鳥配置","画像"],"not_rendered":{"charts":1,"images":75,"macros":1,"external_links":0,"defined_names":29,"comments":0,"pivot_tables":0},"unopened":[],"bounds":{"document_bytes":16777216,"sheet_cells":100000,"rows_first":2000,"rows_last":500,"rows_between":2000,"halvings":0,"cell_chars":16384,"cell_head_chars":4096},"cells_cut":0,"cells_raw":0,"read":"whole","date_system":"1900"}

{"sheet":"シート構成","index":0,"n_rows":23,"n_cols":5,"rows_kept":23,"cut":false,"hidden":false,"merged":[[5,3,8,3],[5,1,11,1],[2,1,3,1]]}
[null,"シートの構成"]
[null,"入力の有無","シート名"]
[null,"入力必要","☆","シート概要：","⇒改良体が負担する盛土面積Vsoilと原地盤が負担するAsoilを算出する。(旧verの計算式も対応）"]
[null,null,null,"参照シート：","画像、単軸三角形配置、単軸四角形配置、二軸四角形配置、二軸千鳥配置"]
[]
[null,"入力不要","単軸三角形配置","シート概要：","⇒三角形配置の影響円と基本配置の関係を算出。計算結果を☆【体積計算シート】に反映させている。面積の計算根拠模式図有"]
[null,null,"単軸四角形配置",null,"※このシートに入力する必要はありません。"]
[null,null,"二軸四角形配置",null,"※これらのシート名を変更、削除、シートの構成を変更すると体積の算出が出来なくなる。"]
[null,null,"二軸千鳥配置"]
[null,null,null,"参照シート：","☆⇒配置条件、盛土高さ、塑性角θの条件　を参照している。"]
[null,null,"画像","シート概要：","⇒配置を選んだ時の画像を反映させる。"]
[null,null,null,"参照シート：","☆、計算シート"]
[]
[null,"入力手順","シート名","入力"]
[null,"手順①","☆","計算条件入力（配置、盛土高さ、塑性角条件"]
[null,"手順②","☆","体積計算マクロの実行"]
[]
[null,"その他"]
[null,"入力セル","⇩基本的に青字の黄色でハッチングしてある箇所が入力項目。"]
[null,null,2.2999999999999998]
[]
[null,"※新特許は、改良体に生じる体積の計算方法のみ"]
[null,"計算方法は従来と同様。体積の計算のみ行い従来のシートに貼り付けでOK"]

{"sheet":"sheet説明⇒【☆】Vsoil算出計算","index":1,"n_rows":530,"n_cols":41,"rows_kept":530,"cut":false,"hidden":false,"merged":[[3,19,3,24],[4,2,5,3],[4,19,4,24],[5,19,6,24],[10,2,10,3],[1,1,1,3],[2,2,2,3],[2,7,11,9],[3,1,10,1],[3,2,3,3],[17,4,17,7],[17,8,17,9],[14,1,15,1],[14,4,15,4],[14,5,15,5],[14,6,15,6],[12,1,13,1],[12,2,12,3],[12,7,12,9],[13,2,13,3],[13,7,13,9]]}
["盛土体積 計算条件"]
[null,"項　　　目",null,null,"記号","値","単位","備考",null,null,null,null,null,"旧計算Vsoil"]
[null,null,"改良体配置",null,null,"単軸四角形配置",null,"飛び出ないようにダミー入力",null,null,null,null,"単軸三角形配置",8.645368070421668,null,null,"Ｖsoil算出のための判定式及び適用式（単軸四角形配置）",null,null,null,null,null,null,null,null,null,null,null,null,null,"二軸四角形配置",null,null,null,null,"仕様の確認用グラフ"]
[null,"セメント\nコラム\n改良体","改良体直径",null,"ｄ",1,"m",null,null,null,null,null,"単軸四角形配置",13.702600349098242,null,null,null,"盛土高さ",null,"改良体間荷重算定モデルと盛土高さとの関係",null,null,null,null,null,"判定式",null,"適用式","Ｖsoil","計算結果","適用式","Ｖsoil","計算結果","計算結果",null,"標準的な仕様範囲",null,null,"試験施工などで検討可能な範囲"]
[null,null,"改良体間隔\n (改良体中心間隔)",null,"a",2,"〃",null,null,null,null,null,"二軸四角配置",16.560113424788579,null,null,1,"Ｈe1以上",null,"改良体間荷重算定モデル土塊が全て盛土内",null,null,null,null,null,"Ｈe1≦Ｈe",null,"5.8","{(λ－ｄ)／2×λ^2－π×(λ^3－ｄ^3)／24＋(4－π)×(√2－1)／24×λ^3}×tanθ",13.741477077061678,"p17 2007マニュアル","1/2(λ-d)・(λ-d)/2・tanθ・d/2・2＝",2.8575130756903371,16.598990152752016,null,"d","λ","ap","d","λ","ap"]
[null,null,null,null,"b",2,"〃",null,null,null,null,null,"二軸千鳥配置","※未対応",null,null,2,"Ｈe2～Ｈe1",null,"改良体間荷重算定モデル土塊の上部が盛土上面にある",null,null,null,null,null,"Ｈe2＜Ｈe＜Ｈe1",null,"5.9","[(λ－ｄ)／2×λ^2－π×(λ^3－ｄ^3)／24＋【1-［{(0.5^2-d)tanθ-2Ｈe}／{(√2-1)×λ×tanθ}］^3】×(4－π)×(√2－1)／24×λ^3]×tanθ",13.702600349098242,null,null,2.8575130756903371,16.560113424788579,null,0.6,1,28.274333882308138,0.6,1,28.274333882308138]
[null,null,"",null,"","","〃",null,null,null,null,null,"計算に反映⇨",{"$f":"IF(F3=M6,N6,(LOOKUP(F3,M3:M5,N3:N5)))","v":13.702600349098242},null,null,3,"Ｈe2以下",null,null,null,null,null,null,null,"Ｈe≦Ｈe2",null,"5.10","λ^2×Ｈe－1／3×{π×(Ｈe／tanθ＋ｄ／2)^2×(ｄ／2tanθ×Ｈe)－π×(ｄ／2)^3×tanθ}",11.956519408730614,null,null,2.8575130756903371,14.814032484420951,null,1,1,78.539816339744831,1,1,78.539816339744831]
[null,null,"",null,"",3,"〃",null,null,null,null,null,null,1.1352437156274986,null,null,null,null,null,null,null,null,null,null,null,null,null,null,null,null,null,null,null,null,null,1.3,1.3,78.539816339744831,1.3,1.3,78.539816339744831]
[null,null,"改良体間隔(大)",null,"λ",2,"〃",null,null,null,null,null,null,null,null,null,null,"Ｈe：","盛土高さ",null,null,"Ｈe＝",9,"m","判定：",2,null,null,null,null,null,null,null,null,null,1.3,2.5,21.237166338267002,1.8,1.8,78.539816339744831]
[null,null,"改良体間隔(小)",null,"x",2,"〃",null,null,null,null,"盛土高",null,null,null,null,null,"Ｈe1：","{(√2・λ－ｄ)tanθ}／2",null,null,"Ｈe1＝",10.449508833818252,"m",null,null,null,null,null,null,null,null,null,null,null,0.89206205807638561,2.5,10,1.8,3.25,24.091740112735931]
[null,null,"改良率",null,"ａp",0.19634954084936207,"-",null,null,null,null,"計画高","原地盤高","盛土高","F8",null,null,"Ｈe2：","{(λ－ｄ)tanθ}／2",null,null,"Ｈe2＝",5.7150261513806742,"m",null,null,null,null,null,null,null,null,null,null,null,0.6,1.6814973649193785,10,0.98692869637193126,3,8.5]
[null,"",null,null,"",null,null,null,null,null,null,9,0,9,null,null,null,null,null,null,null,null,null,null,null,null,null,null,null,null,null,null,null,null,null,0.6,1,28.274333882308138,0.6,1.8238399659641238,8.5]
[null,"盛土条件","盛土高さ",null,"Ｈe",{"$f":"+N12","v":9},"m",{"$f":"+IF(AND(L12=\"\",M12=\"\"),\"\",\"ＦH＝\"&FIXED(L12,2)&\"m，ＧL＝\"&FIXED(M12,2)&\"m\")","v":"ＦH＝9.00m，ＧL＝0.00m"},null,null,null,null,null,null,null,null,"Ｖsoil算出のための判定式及び適用式（単軸三角形配置）",null,null,null,null,null,null,null,null,null,null,null,null,null,null,null,null,null,null,null,null,null,{"$f":"+AM6","v":0.6},{"$f":"+AN6","v":1},{"$f":"+AO6","v":28.274333882308138}]
[null,null,"盛土の内部摩擦角",null,"φ",30,"度",null,null,null,null,"塑性角",{"$f":"+D15","v":"浮き型"},null,null,null,null,"d",{"$f":"F4","v":1},"D1",{"$f":"1/2*SQRT(S20^2+S15^2/4)","v":0.48923320324026087},"V1",{"$f":"0.5*S15*S20*U18","v":0.21026716764198256},null,null,null,null,null,null,null,null,null,null,null,null,{"$f":"+AJ15","v":1},{"$f":"+AK33","v":0}]
[null,"塑性角","改良形式：","浮き型","θ",85,"度",null,null,null,null,"ジオテキ","浅層改良","なし","塑性角予備",null,null,"d",1,"D1",1.2247448713915892,"V1",19.168780451514291,null,null,null,null,null,null,null,null,null,null,null,null,1,0]
[null,null,"補助工法：","浅層改良",null,null,null,null,null,null,null,75,85,80,85,null,null,"λ",2,"D2",0.72474487139158916,"V2",2.8164430355875201,null,null,null,null,null,null,null,null,null,null,null,null,1,2]
[null,null,null,null,null,null,null,null,null,null,null,null,null,null,null,null,null,"a",2,"D3",1,"V3",3.8518226732954233,null,null,null,null,null,null,null,null,null,null,null,null,0,2]
[null,"影響円D","影響円直径D","その時の高さ","影響円Dの範囲条件",null,null,null,"概要",null,null,null,null,null,null,null,null,"α",1.1502619915109311,"D4",0.5,"V4",-0.40313066133029613]
[null,"d",1,0,"STEP-0：底面積（d=D）",null,null,null,"底面積A0",null,null,"B17","C17","D17","U5",null,null,"β",0.72972765622696645,"h1",8.5725392270710135,"V5",0.19990333120802034]
[null,"b",2,5.7150261513806742,"STEP-1：影響円D範囲(d≦D<b）",null,null,null,"底面積A1",null,null,"B18","C18","D18","U6",null,null,"γ",0.84106867056793022,"h2",2.5688456347832367,"Vsoil",8.645368070421668]
[null,"a",2.0001000000000002,5.7155976539958138,"STEP-2：影響円D範囲(b≦D<a）",null,null,null,"底面積A2",null,null,"B19","C19","D19","U7",null,null,"μ",2.2360679774997898,"h3",5.7150261513806742]
[null,"√(a2+b2）",2.8284271247461903,10.449508833818252,"STEP-3：影響円D範囲(a≦D<√(a^2+b^2））",null,null,null,"底面積A3",null,null,"B20","C20","D20","U8",null,null,"s",3.2360679774997898,"h4",6.0036935922877763]
[null,"---","---","end","計算範囲外",null,null,null,"",null,null,"B21","C21","D21","U9",null,null,"4√｛(s(s-λ)(s-μ)(ｓ-c)｝",8,"h5",2.8575130756903393]
["体積の算出",null,null,null,null,null,null,null,null,null,null,null,null,null,null,null,null,"外接円R",1.2500000000000002,"h6",5.7150261513806742]
[null,"配置型式","単軸四角形配置"]
[null,"スタート",0,"m",null,"step数","STEP-3：影響円D範囲(a≦D<√(a^2+b^2））",null,null,null,null,"AB23"]
[null,"エンド",9,"m",null,"高さH",null,null,9,"m"]
[null,"キザミ",0.25,"m",20,"面積",null,null,6.6618498314321428E-2,"m2",null,"AA23"]
[null,"回数",38,"回",null,"体積",null,null,13.589898671776899,"m3"]
[null,"参考キザミ幅",0.3,"m"]
[]
["盛土計算各step上限地盤高さ",null,null,null,null,null,null,null,null,null,null,"D17"]
[null,"step0",0,null,null,null,null,null,null,null,null,"D18"]
[null,"step1",5.7150261513806742,null,null,null,null,null,null,null,null,"D19"]
[null,"step2",5.7155976539958138,null,null,null,null,null,null,null,null,"D20"]
[null,"step3",10.449508833818252,null,null,null,null,null,null,null,null,"D21"]
[null,"step4","end"]
[null,null,"end"]
[]
[]
[]
[]
[null,"出力列№(step数）",null,2]
[null,"出力列№\n(横軸）",null,6]
[null,"出力列№\n(縦軸）",null,7,null,"（参考）旧計算Vsoil=","13.70(㎥)",null,"∴新計算体積Vsoil=","13.59(㎥)"]
[null,null,null,null,null,null,null,"Asoil=",{"$f":"N8","v":1.1352437156274986},"m2"]
[null,null,null,null,null,null,null,null,13.589898671776899,null,null,null,null,null,7.7021439614410241,null,null,null,0,null,null,null,0,null,null,null,0,null,null,null,0]
[null,"表示列№",null,null,null,6,7,8,9,null,null,{"$f":"I48+3","v":12},{"$f":"L48+1","v":13},14,15,16,{"$f":"N48+3","v":17},{"$f":"Q48+1","v":18},19,20,21,{"$f":"S48+3","v":22},{"$f":"V48+1","v":23},24,25,26,{"$f":"X48+3","v":27},{"$f":"AA48+1","v":28},29,30,31,{"$f":"AC48+3","v":32},{"$f":"AF48+1","v":33},34,35,36]
[null,"凡例名",null,null,null,"高さH","面積","平均面積","体積",null,null,"凡例名","高さH","面積","平均面積","体積","凡例名","高さH","面積","平均面積","体積","凡例名","高さH","面積","平均面積","体積","凡例名","高さH","面積","平均面積","体積","凡例名","高さH","面積","平均面積","体積"]
[null,"STEP-0：底面積（d=D）",null,null,null,0,3.2146018366025517,3.179493662945446,0.7948734157363615,null,null,null,null,null,{"$f":"IFERROR(AVERAGE(N50:N51),\"\")","v":""},{"$f":"IFERROR(O50*(M51-M50),\"\")","v":""},null,null,null,{"$f":"IFERROR(AVERAGE(S50:S51),\"\")","v":""},{"$f":"IFERROR(T50*(R51-R50),\"\")","v":""},null,null,null,{"$f":"IFERROR(AVERAGE(X50:X51),\"\")","v":""},{"$f":"IFERROR(Y50*(W51-W50),\"\")","v":""},null,null,null,{"$f":"IFERROR(AVERAGE(AC50:AC51),\"\")","v":""},{"$f":"IFERROR(AD50*(AB51-AB50),\"\")","v":""},null,null,null,{"$f":"IFERROR(AVERAGE(AH50:AH51),\"\")","v":""},{"$f":"IFERROR(AI50*(AG51-AG50),\"\")","v":""}]
[null,"STEP-1：影響円D範囲(d≦D<b）",null,null,null,0.25,3.1443854892883407,3.1077744039683823,0.77694360099209558,null,null,null,null,null,{"$f":"IFERROR(AVERAGE(N51:N52),\"\")","v":""},{"$f":"IFERROR(O51*(M52-M51),\"\")","v":""},null,null,null,{"$f":"IFERROR(AVERAGE(S51:S52),\"\")","v":""},{"$f":"IFERROR(T51*(R52-R51),\"\")","v":""},null,null,null,{"$f":"IFERROR(AVERAGE(X51:X52),\"\")","v":""},{"$f":"IFERROR(Y51*(W52-W51),\"\")","v":""},null,null,null,{"$f":"IFERROR(AVERAGE(AC51:AC52),\"\")","v":""},{"$f":"IFERROR(AD51*(AB52-AB51),\"\")","v":""},null,null,null,{"$f":"IFERROR(AVERAGE(AH51:AH52),\"\")","v":""},{"$f":"IFERROR(AI51*(AG52-AG51),\"\")","v":""}]
[null,"STEP-1：影響円D範囲(d≦D<b）",null,null,null,0.5,3.071163318648424,3.0330493216656125,0.75826233041640312,null,null,null,null,null,"","",null,null,null,"","",null,null,null,"","",null,null,null,"","",null,null,null,"",""]
[null,"STEP-1：影響円D範囲(d≦D<b）",null,null,null,0.75,2.994935324682801,2.9553184160371364,0.7388296040092841,null,null,null,null,null,"","",null,null,null,"","",null,null,null,"","",null,null,null,"","",null,null,null,"",""]
[null,"STEP-1：影響円D範囲(d≦D<b）",null,null,null,1,2.9157015073914723,2.8745816870829546,0.71864542177073865,null,null,null,null,null,"","",null,null,null,"","",null,null,null,"","",null,null,null,"","",null,null,null,"",""]
[null,"STEP-1：影響円D範囲(d≦D<b）",null,null,null,1.25,2.8334618667744369,2.7908391348030666,0.69770978370076664,null,null,null,null,null,"","",null,null,null,"","",null,null,null,"","",null,null,null,"","",null,null,null,"",""]
[null,"STEP-1：影響円D範囲(d≦D<b）",null,null,null,1.5,2.7482164028316962,2.7040907591974732,0.6760226897993683,null,null,null,null,null,"","",null,null,null,"","",null,null,null,"","",null,null,null,"","",null,null,null,"",""]
[null,"STEP-1：影響円D範囲(d≦D<b）",null,null,null,1.75,2.6599651155632502,2.6143365602661737,0.65358414006654342,null,null,null,null,null,"","",null,null,null,"","",null,null,null,"","",null,null,null,"","",null,null,null,"",""]
[null,"STEP-1：影響円D範囲(d≦D<b）",null,null,null,2,2.5687080049690971,2.5215765380091684,0.63039413450229209,null,null,null,null,null,"","",null,null,null,"","",null,null,null,"","",null,null,null,"","",null,null,null,"",""]
[null,"STEP-1：影響円D範囲(d≦D<b）",null,null,null,2.25,2.4744450710492392,2.4258106924264569,0.60645267310661422,null,null,null,null,null,"","",null,null,null,"","",null,null,null,"","",null,null,null,"","",null,null,null,"",""]
[null,"STEP-1：影響円D範囲(d≦D<b）",null,null,null,2.5,2.3771763138036746,2.3270390235180392,0.58175975587950979,null,null,null,null,null,"","",null,null,null,"","",null,null,null,"","",null,null,null,"","",null,null,null,"",""]
[null,"STEP-1：影響円D範囲(d≦D<b）",null,null,null,2.75,2.2769017332324042,2.2252615312839161,0.55631538282097903,null,null,null,null,null,"","",null,null,null,"","",null,null,null,"","",null,null,null,"","",null,null,null,"",""]
[null,"STEP-1：影響円D範囲(d≦D<b）",null,null,null,3,2.1736213293354281,2.1204782157240869,0.53011955393102173,null,null,null,null,null,"","",null,null,null,"","",null,null,null,"","",null,null,null,"","",null,null,null,"",""]
[null,"STEP-1：影響円D範囲(d≦D<b）",null,null,null,3.25,2.0673351021127453,2.0126890768385515,0.50317226920963787,null,null,null,null,null,"","",null,null,null,"","",null,null,null,"","",null,null,null,"","",null,null,null,"",""]
[null,"STEP-1：影響円D範囲(d≦D<b）",null,null,null,3.5,1.9580430515643572,1.9018941146273101,0.47547352865682752,null,null,null,null,null,"","",null,null,null,"","",null,null,null,"","",null,null,null,"","",null,null,null,"",""]
[null,"STEP-1：影響円D範囲(d≦D<b）",null,null,null,3.75,1.8457451776902629,1.7880933290903629,0.44702333227259072,null,null,null,null,null,"","",null,null,null,"","",null,null,null,"","",null,null,null,"","",null,null,null,"",""]
[null,"STEP-1：影響円D範囲(d≦D<b）",null,null,null,4,1.7304414804904629,1.6712867202277097,0.41782168005692744,null,null,null,null,null,"","",null,null,null,"","",null,null,null,"","",null,null,null,"","",null,null,null,"",""]
[null,"STEP-1：影響円D範囲(d≦D<b）",null,null,null,4.25,1.6121319599649566,1.5514742880393506,0.38786857200983765,null,null,null,null,null,"","",null,null,null,"","",null,null,null,"","",null,null,null,"","",null,null,null,"",""]
[null,"STEP-1：影響円D範囲(d≦D<b）",null,null,null,4.5,1.4908166161137446,1.4286560325252855,0.35716400813132138,null,null,null,null,null,"","",null,null,null,"","",null,null,null,"","",null,null,null,"","",null,null,null,"",""]
[null,"STEP-1：影響円D範囲(d≦D<b）",null,null,null,4.75,1.3664954489368264,1.3028319536855149,0.32570798842137871,null,null,null,null,null,"","",null,null,null,"","",null,null,null,"","",null,null,null,"","",null,null,null,"",""]
[null,"STEP-1：影響円D範囲(d≦D<b）",null,null,null,5,1.2391684584342033,1.174002051520038,0.2935005128800095,null,null,null,null,null,"","",null,null,null,"","",null,null,null,"","",null,null,null,"","",null,null,null,"",""]
[null,"STEP-1：影響円D範囲(d≦D<b）",null,null,null,5.25,1.1088356446058727,1.0421663260288552,0.26054158150721379,null,null,null,null,null,"","",null,null,null,"","",null,null,null,"","",null,null,null,"","",null,null,null,"",""]
[null,"STEP-1：影響円D範囲(d≦D<b）",null,null,null,5.5,0.97549700745183765,0.91695217693102227,0.19716869760560871,null,null,null,null,null,"","",null,null,null,"","",null,null,null,"","",null,null,null,"","",null,null,null,"",""]
[null,"STEP-2：影響円D範囲(b≦D<a）",null,null,null,5.7150261513806742,0.85840734641020688,0.85825159620720282,4.9049303168015876E-4,null,null,null,null,null,"","",null,null,null,"","",null,null,null,"","",null,null,null,"","",null,null,null,"",""]
[null,"STEP-3：影響円D範囲(a≦D<√(a^2+b^2））",null,null,null,5.7155976539958138,0.85809584600419875,0.80096051123252066,0.20024012780813016,null,null,null,null,null,"","",null,null,null,"","",null,null,null,"","",null,null,null,"","",null,null,null,"",""]
[null,"STEP-3：影響円D範囲(a≦D<√(a^2+b^2））",null,null,null,5.9655976539958138,0.74382517646084256,0.69560819101748628,0.17390204775437157,null,null,null,null,null,"","",null,null,null,"","",null,null,null,"","",null,null,null,"","",null,null,null,"",""]
[null,"STEP-3：影響円D範囲(a≦D<√(a^2+b^2））",null,null,null,6.2155976539958138,0.64739120557412999,0.60472997759316849,0.15118249439829212,null,null,null,null,null,"","",null,null,null,"","",null,null,null,"","",null,null,null,"","",null,null,null,"",""]
[null,"STEP-3：影響円D範囲(a≦D<√(a^2+b^2））",null,null,null,6.4655976539958138,0.56206874961220699,0.52381188960330805,0.13095297240082701,null,null,null,null,null,"","",null,null,null,"","",null,null,null,"","",null,null,null,"","",null,null,null,"",""]
[null,"STEP-3：影響円D範囲(a≦D<√(a^2+b^2））",null,null,null,6.7155976539958138,0.4855550295944091,0.4510618405081267,0.11276546012703167,null,null,null,null,null,"","",null,null,null,"","",null,null,null,"","",null,null,null,"","",null,null,null,"",""]
[null,"STEP-3：影響円D範囲(a≦D<√(a^2+b^2））",null,null,null,6.9655976539958138,0.41656865142184429,0.38542237233243892,9.6355593083109731E-2,null,null,null,null,null,"","",null,null,null,"","",null,null,null,"","",null,null,null,"","",null,null,null,"",""]
[null,"STEP-3：影響円D範囲(a≦D<√(a^2+b^2））",null,null,null,7.2155976539958138,0.35427609324303355,0.32618151051248323,8.1545377628120808E-2,null,null,null,null,null,"","",null,null,null,"","",null,null,null,"","",null,null,null,"","",null,null,null,"",""]
[null,"STEP-3：影響円D範囲(a≦D<√(a^2+b^2））",null,null,null,7.4655976539958138,0.29808692778193291,0.27282318624185653,6.8205796560464133E-2,null,null,null,null,null,"","",null,null,null,"","",null,null,null,"","",null,null,null,"","",null,null,null,"",""]
[null,"STEP-3：影響円D範囲(a≦D<√(a^2+b^2））",null,null,null,7.7155976539958138,0.24755944470178015,0.22495487277167159,5.6238718192917897E-2]
[null,"STEP-3：影響円D範囲(a≦D<√(a^2+b^2））",null,null,null,7.9655976539958138,0.20235030084156302,0.18226761069158903,4.5566902672897418E-2]
[null,"STEP-3：影響円D範囲(a≦D<√(a^2+b^2））",null,null,null,8.2155976539958147,0.16218492054161504,0.14451187902106505,3.6127969755266262E-2]
[null,"STEP-3：影響円D範囲(a≦D<√(a^2+b^2））",null,null,null,8.4655976539958147,0.12683883750051506,0.11148206691824358,2.7870516729560896E-2]
[null,"STEP-3：影響円D範囲(a≦D<√(a^2+b^2））",null,null,null,8.7155976539958147,9.612529633597211E-2,8.3005980858039563E-2,2.0751495214509891E-2]
[null,"STEP-3：影響円D範囲(a≦D<√(a^2+b^2））",null,null,null,8.9655976539958147,6.9886665380107016E-2,6.8252581847214222E-2,2.3480489363868436E-3]
[null,"STEP-3：影響円D範囲(a≦D<√(a^2+b^2））",null,null,null,9,6.6618498314321428E-2,6.6618498314321428E-2,0]
[null,null,null,null,null,9,null,"",""]
[null,null,null,null,null,null,null,"",""]
[null,null,null,null,null,null,null,"",""]
[null,null,null,null,null,null,null,"",""]
[null,null,null,null,null,null,null,"",""]
[null,null,null,null,null,null,null,"",""]
[null,null,null,null,null,null,null,"","",null,null,null,null,null,"","",null,null,null,{"$f":"IFERROR(AVERAGE(S95:S96),\"\")","v":""},{"$f":"IFERROR(T95*(R96-R95),\"\")","v":""},null,null,null,{"$f":"IFERROR(AVERAGE(X95:X96),\"\")","v":""},{"$f":"IFERROR(Y95*(W96-W95),\"\")","v":""},null,null,null,{"$f":"IFERROR(AVERAGE(AC95:AC96),\"\")","v":""},{"$f":"IFERROR(AD95*(AB96-AB95),\"\")","v":""},null,null,null,{"$f":"IFERROR(AVERAGE(AH95:AH96),\"\")","v":""},{"$f":"IFERROR(AI95*(AG96-AG95),\"\")","v":""}]
[null,null,null,null,null,null,null,"","",null,null,null,null,null,"","",null,null,null,"","",null,null,null,"","",null,null,null,"","",null,null,null,"",""]
[null,null,null,null,null,null,null,"","",null,null,null,null,null,"","",null,null,null,"","",null,null,null,"","",null,null,null,"","",null,null,null,"",""]
[null,null,null,null,null,null,null,"","",null,null,null,null,null,"","",null,null,null,"","",null,null,null,"","",null,null,null,"","",null,null,null,"",""]
[null,null,null,null,null,null,null,"","",null,null,null,null,null,"","",null,null,null,"","",null,null,null,"","",null,null,null,"","",null,null,null,"",""]
[null,null,null,null,null,null,null,"","",null,null,null,null,null,"","",null,null,null,"","",null,null,null,"","",null,null,null,"","",null,null,null,"",""]
[null,null,null,null,null,null,null,"","",null,null,null,null,null,"","",null,null,null,"","",null,null,null,"","",null,null,null,"","",null,null,null,"",""]
[null,null,null,null,null,null,null,"","",null,null,null,null,null,"","",null,null,null,"","",null,null,null,"","",null,null,null,"","",null,null,null,"",""]
[null,null,null,null,null,null,null,"","",null,null,null,null,null,"","",null,null,null,"","",null,null,null,"","",null,null,null,"","",null,null,null,"",""]
[null,null,null,null,null,null,null,"","",null,null,null,null,null,"","",null,null,null,"","",null,null,null,"","",null,null,null,"","",null,null,null,"",""]
[null,null,null,null,null,null,null,"","",null,null,null,null,null,"","",null,null,null,"","",null,null,null,"","",null,null,null,"","",null,null,null,"",""]
[null,null,null,null,null,null,null,"","",null,null,null,null,null,"","",null,null,null,"","",null,null,null,"","",null,null,null,"","",null,null,null,"",""]
[null,null,null,null,null,null,null,"","",null,null,null,null,null,"","",null,null,null,"","",null,null,null,"","",null,null,null,"","",null,null,null,"",""]
[null,null,null,null,null,null,null,"","",null,null,null,null,null,"","",null,null,null,"","",null,null,null,"","",null,null,null,"","",null,null,null,"",""]
[null,null,null,null,null,null,null,"","",null,null,null,null,null,"","",null,null,null,"","",null,null,null,"","",null,null,null,"","",null,null,null,"",""]
[null,null,null,null,null,null,null,"","",null,null,null,null,null,"","",null,null,null,"","",null,null,null,"","",null,null,null,"","",null,null,null,"",""]
[null,null,null,null,null,null,null,"","",null,null,null,null,null,"","",null,null,null,"","",null,null,null,"","",null,null,null,"","",null,null,null,"",""]
[null,null,null,null,null,null,null,"","",null,null,null,null,null,"","",null,null,null,"","",null,null,null,"","",null,null,null,"","",null,null,null,"",""]
[null,null,null,null,null,null,null,"","",null,null,null,null,null,"","",null,null,null,"","",null,null,null,"","",null,null,null,"","",null,null,null,"",""]
[null,null,null,null,null,null,null,"","",null,null,null,null,null,"","",null,null,null,"","",null,null,null,"","",null,null,null,"","",null,null,null,"",""]
[null,null,null,null,null,null,null,"","",null,null,null,null,null,{"$f":"IFERROR(AVERAGE(N115:N116),\"\")","v":""},{"$f":"IFERROR(O115*(M116-M115),\"\")","v":""},null,null,null,"","",null,null,null,"","",null,null,null,"","",null,null,null,"",""]
[null,null,null,null,null,null,null,"","",null,null,null,null,null,"","",null,null,null,"","",null,null,null,"","",null,null,null,"","",null,null,null,"",""]
[null,null,null,null,null,null,null,"","",null,null,null,null,null,"","",null,null,null,"","",null,null,null,"","",null,null,null,"","",null,null,null,"",""]
[null,null,null,null,null,null,null,"","",null,null,null,null,null,"","",null,null,null,"","",null,null,null,"","",null,null,null,"","",null,null,null,"",""]
[null,null,null,null,null,null,null,"","",null,null,null,null,null,"","",null,null,null,"","",null,null,null,"","",null,null,null,"","",null,null,null,"",""]
[null,null,null,null,null,null,null,"","",null,null,null,null,null,"","",null,null,null,"","",null,null,null,"","",null,null,null,"","",null,null,null,"",""]
[null,null,null,null,null,null,null,"","",null,null,null,null,null,"","",null,null,null,"","",null,null,null,"","",null,null,null,"","",null,null,null,"",""]
[null,null,null,null,null,null,null,"","",null,null,null,null,null,"","",null,null,null,"","",null,null,null,"","",null,null,null,"","",null,null,null,"",""]
[null,null,null,null,null,null,null,"","",null,null,null,null,null,"","",null,null,null,"","",null,null,null,"","",null,null,null,"","",null,null,null,"",""]
[null,null,null,null,null,null,null,"","",null,null,null,null,null,"","",null,null,null,"","",null,null,null,"","",null,null,null,"","",null,null,null,"",""]
[null,null,null,null,null,null,null,"","",null,null,null,null,null,"","",null,null,null,"","",null,null,null,"","",null,null,null,"","",null,null,null,"",""]
[null,null,null,null,null,null,null,"","",null,null,null,null,null,"","",null,null,null,"","",null,null,null,"","",null,null,null,"","",null,null,null,"",""]
[null,null,null,null,null,null,null,"","",null,null,null,null,null,"","",null,null,null,"","",null,null,null,"","",null,null,null,"","",null,null,null,"",""]
[null,null,null,null,null,null,null,"","",null,null,null,null,null,"","",null,null,null,"","",null,null,null,"","",null,null,null,"","",null,null,null,"",""]
[null,null,null,null,null,null,null,"","",null,null,null,null,null,"","",null,null,null,"","",null,null,null,"","",null,null,null,"","",null,null,null,"",""]
[null,null,null,null,null,null,null,"","",null,null,null,null,null,"","",null,null,null,"","",null,null,null,"","",null,null,null,"","",null,null,null,"",""]
[null,null,null,null,null,null,null,"","",null,null,null,null,null,"","",null,null,null,"","",null,null,null,"","",null,null,null,"","",null,null,null,"",""]
[null,null,null,null,null,null,null,"","",null,null,null,null,null,"","",null,null,null,"","",null,null,null,"","",null,null,null,"","",null,null,null,"",""]
[null,null,null,null,null,null,null,"","",null,null,null,null,null,"","",null,null,null,"","",null,null,null,"","",null,null,null,"","",null,null,null,"",""]
[null,null,null,null,null,null,null,"","",null,null,null,null,null,"","",null,null,null,"","",null,null,null,"","",null,null,null,"","",null,null,null,"",""]
[null,null,null,null,null,null,null,"","",null,null,null,null,null,"","",null,null,null,"","",null,null,null,"","",null,null,null,"","",null,null,null,"",""]
[null,null,null,null,null,null,null,"","",null,null,null,null,null,"","",null,null,null,"","",null,null,null,"","",null,null,null,"","",null,null,null,"",""]
[null,null,null,null,null,null,null,"","",null,null,null,null,null,"","",null,null,null,"","",null,null,null,"","",null,null,null,"","",null,null,null,"",""]
[null,null,null,null,null,null,null,"","",null,null,null,null,null,"","",null,null,null,"","",null,null,null,"","",null,null,null,"","",null,null,null,"",""]
[null,null,null,null,null,null,null,"","",null,null,null,null,null,"","",null,null,null,"","",null,null,null,"","",null,null,null,"","",null,null,null,"",""]
[null,null,null,null,null,null,null,"","",null,null,null,null,null,"","",null,null,null,"","",null,null,null,"","",null,null,null,"","",null,null,null,"",""]
[null,null,null,null,null,null,null,"","",null,null,null,null,null,"","",null,null,null,"","",null,null,null,"","",null,null,null,"","",null,null,null,"",""]
[null,null,null,null,null,null,null,"","",null,null,null,null,null,"","",null,null,null,"","",null,null,null,"","",null,null,null,"","",null,null,null,"",""]
[null,null,null,null,null,null,null,"","",null,null,null,null,null,"","",null,null,null,"","",null,null,null,"","",null,null,null,"","",null,null,null,"",""]
[null,null,null,null,null,null,null,"","",null,null,null,null,null,"","",null,null,null,"","",null,null,null,"","",null,null,null,"","",null,null,null,"",""]
[null,null,null,null,null,null,null,"","",null,null,null,null,null,"","",null,null,null,"","",null,null,null,"","",null,null,null,"","",null,null,null,"",""]
[null,null,null,null,null,null,null,"","",null,null,null,null,null,"","",null,null,null,"","",null,null,null,"","",null,null,null,"","",null,null,null,"",""]
[null,null,null,null,null,null,null,"","",null,null,null,null,null,"","",null,null,null,"","",null,null,null,"","",null,null,null,"","",null,null,null,"",""]
[null,null,null,null,null,null,null,"","",null,null,null,null,null,"","",null,null,null,"","",null,null,null,"","",null,null,null,"","",null,null,null,"",""]
[null,null,null,null,null,null,null,"","",null,null,null,null,null,"","",null,null,null,"","",null,null,null,"","",null,null,null,"","",null,null,null,"",""]
[null,null,null,null,null,null,null,"","",null,null,null,null,null,"","",null,null,null,"","",null,null,null,"","",null,null,null,"","",null,null,null,"",""]
[null,null,null,null,null,null,null,"","",null,null,null,null,null,"","",null,null,null,"","",null,null,null,"","",null,null,null,"","",null,null,null,"",""]
[null,null,null,null,null,null,null,"","",null,null,null,null,null,"","",null,null,null,"","",null,null,null,"","",null,null,null,"","",null,null,null,"",""]
[null,null,null,null,null,null,null,"","",null,null,null,null,null,"","",null,null,null,"","",null,null,null,"","",null,null,null,"","",null,null,null,"",""]
[null,null,null,null,null,null,null,"","",null,null,null,null,null,"","",null,null,null,"","",null,null,null,"","",null,null,null,"","",null,null,null,"",""]
[null,null,null,null,null,null,null,"","",null,null,null,null,null,"","",null,null,null,"","",null,null,null,"","",null,null,null,"","",null,null,null,"",""]
[null,null,null,null,null,null,null,"","",null,null,null,null,null,"","",null,null,null,"","",null,null,null,"","",null,null,null,"","",null,null,null,"",""]
[null,null,null,null,null,null,null,"","",null,null,null,null,null,"","",null,null,null,"","",null,null,null,"","",null,null,null,"","",null,null,null,"",""]
[null,null,null,null,null,null,null,"","",null,null,null,null,null,"","",null,null,null,"","",null,null,null,"","",null,null,null,"","",null,null,null,"",""]
[null,null,null,null,null,null,null,"","",null,null,null,null,null,"","",null,null,null,{"$f":"IFERROR(AVERAGE(S159:S160),\"\")","v":""},{"$f":"IFERROR(T159*(R160-R159),\"\")","v":""},null,null,null,{"$f":"IFERROR(AVERAGE(X159:X160),\"\")","v":""},{"$f":"IFERROR(Y159*(W160-W159),\"\")","v":""},null,null,null,{"$f":"IFERROR(AVERAGE(AC159:AC160),\"\")","v":""},{"$f":"IFERROR(AD159*(AB160-AB159),\"\")","v":""},null,null,null,{"$f":"IFERROR(AVERAGE(AH159:AH160),\"\")","v":""},{"$f":"IFERROR(AI159*(AG160-AG159),\"\")","v":""}]
[null,null,null,null,null,null,null,"","",null,null,null,null,null,"","",null,null,null,"","",null,null,null,"","",null,null,null,"","",null,null,null,"",""]
[null,null,null,null,null,null,null,"","",null,null,null,null,null,"","",null,null,null,"","",null,null,null,"","",null,null,null,"","",null,null,null,"",""]
[null,null,null,null,null,null,null,"","",null,null,null,null,null,"","",null,null,null,"","",null,null,null,"","",null,null,null,"","",null,null,null,"",""]
[null,null,null,null,null,null,null,"","",null,null,null,null,null,"","",null,null,null,"","",null,null,null,"","",null,null,null,"","",null,null,null,"",""]
[null,null,null,null,null,null,null,"","",null,null,null,null,null,"","",null,null,null,"","",null,null,null,"","",null,null,null,"","",null,null,null,"",""]
[null,null,null,null,null,null,null,"","",null,null,null,null,null,"","",null,null,null,"","",null,null,null,"","",null,null,null,"","",null,null,null,"",""]
[null,null,null,null,null,null,null,"","",null,null,null,null,null,"","",null,null,null,"","",null,null,null,"","",null,null,null,"","",null,null,null,"",""]
[null,null,null,null,null,null,null,"","",null,null,null,null,null,"","",null,null,null,"","",null,null,null,"","",null,null,null,"","",null,null,null,"",""]
[null,null,null,null,null,null,null,"","",null,null,null,null,null,"","",null,null,null,"","",null,null,null,"","",null,null,null,"","",null,null,null,"",""]
[null,null,null,null,null,null,null,"","",null,null,null,null,null,"","",null,null,null,"","",null,null,null,"","",null,null,null,"","",null,null,null,"",""]
[null,null,null,null,null,null,null,"","",null,null,null,null,null,"","",null,null,null,"","",null,null,null,"","",null,null,null,"","",null,null,null,"",""]
[null,null,null,null,null,null,null,"","",null,null,null,null,null,"","",null,null,null,"","",null,null,null,"","",null,null,null,"","",null,null,null,"",""]
[null,null,null,null,null,null,null,"","",null,null,null,null,null,"","",null,null,null,"","",null,null,null,"","",null,null,null,"","",null,null,null,"",""]
[null,null,null,null,null,null,null,"","",null,null,null,null,null,{"$f":"IFERROR(AVERAGE(K173:K174),\"\")","v":""},{"$f":"IFERROR(O173*(J174-M173),\"\")","v":""},null,null,null,{"$f":"IFERROR(AVERAGE(P173:P174),\"\")","v":""},{"$f":"IFERROR(T173*(O174-R173),\"\")","v":""},null,null,null,{"$f":"IFERROR(AVERAGE(U173:U174),\"\")","v":""},{"$f":"IFERROR(Y173*(T174-W173),\"\")","v":""},null,null,null,{"$f":"IFERROR(AVERAGE(Z173:Z174),\"\")","v":""},{"$f":"IFERROR(AD173*(Y174-AB173),\"\")","v":""},null,null,null,{"$f":"IFERROR(AVERAGE(AE173:AE174),\"\")","v":""},{"$f":"IFERROR(AI173*(AD174-AG173),\"\")","v":""}]
[null,null,null,null,null,null,null,"",""]
[null,null,null,null,null,null,null,"",""]
[null,null,null,null,null,null,null,"",""]
[null,null,null,null,null,null,null,"",""]
[null,null,null,null,null,null,null,"",""]
[null,null,null,null,null,null,null,"",""]
[null,null,null,null,null,null,null,"",""]
[null,null,null,null,null,null,null,"",""]
[null,null,null,null,null,null,null,"",""]
[null,null,null,null,null,null,null,"",""]
[null,null,null,null,null,null,null,"",""]
[null,null,null,null,null,null,null,"",""]
[null,null,null,null,null,null,null,"",""]
[null,null,null,null,null,null,null,"",""]
[null,null,null,null,null,null,null,"",""]
[null,null,null,null,null,null,null,"",""]
[null,null,null,null,null,null,null,"",""]
[null,null,null,null,null,null,null,"",""]
[null,null,null,null,null,null,null,"",""]
[null,null,null,null,null,null,null,"",""]
[null,null,null,null,null,null,null,"",""]
[null,null,null,null,null,null,null,"",""]
[null,null,null,null,null,null,null,"",""]
[null,null,null,null,null,null,null,"",""]
[null,null,null,null,null,null,null,"",""]
[null,null,null,null,null,null,null,"",""]
[null,null,null,null,null,null,null,"",""]
[null,null,null,null,null,null,null,"",""]
[null,null,null,null,null,null,null,"",""]
[null,null,null,null,null,null,null,"",""]
[null,null,null,null,null,null,null,"",""]
[null,null,null,null,null,null,null,"",""]
[null,null,null,null,null,null,null,"",""]
[null,null,null,null,null,null,null,"",""]
[null,null,null,null,null,null,null,"",""]
[null,null,null,null,null,null,null,"",""]
[null,null,null,null,null,null,null,"",""]
[null,null,null,null,null,null,null,"",""]
[null,null,null,null,null,null,null,"",""]
[null,null,null,null,null,null,null,"",""]
[null,null,null,null,null,null,null,"",""]
[null,null,null,null,null,null,null,"",""]
[null,null,null,null,null,null,null,"",""]
[null,null,null,null,null,null,null,"",""]
[null,null,null,null,null,null,null,"",""]
[null,null,null,null,null,null,null,"",""]
[null,null,null,null,null,null,null,"",""]
[null,null,null,null,null,null,null,"",""]
[null,null,null,null,null,null,null,"",""]
[null,null,null,null,null,null,null,"",""]
[null,null,null,null,null,null,null,"",""]
[null,null,null,null,null,null,null,"",""]
[null,null,null,null,null,null,null,"",""]
[null,null,null,null,null,null,null,"",""]
[null,null,null,null,null,null,null,"",""]
[null,null,null,null,null,null,null,"",""]
[null,null,null,null,null,null,null,"",""]
[null,null,null,null,null,null,null,"",""]
[null,null,null,null,null,null,null,"",""]
[null,null,null,null,null,null,null,"",""]
[null,null,null,null,null,null,null,"",""]
[null,null,null,null,null,null,null,"",""]
[null,null,null,null,null,null,null,"",""]
[null,null,null,null,null,null,null,"",""]
[null,null,null,null,null,null,null,"",""]
[null,null,null,null,null,null,null,"",""]
[null,null,null,null,null,null,null,"",""]
[null,null,null,null,null,null,null,"","",null,null,"","",null,null,"","",null,null,"",""]
[null,null,null,null,null,null,null,"","",null,null,"","",null,null,"","",null,null,"",""]
[null,null,null,null,null,null,null,"","",null,null,"","",null,null,"","",null,null,"",""]
[null,null,null,null,null,null,null,"","",null,null,"","",null,null,"","",null,null,"",""]
[null,null,null,null,null,null,null,"","",null,null,"","",null,null,"","",null,null,"",""]
[null,null,null,null,null,null,null,"","",null,null,"","",null,null,"","",null,null,"",""]
[null,null,null,null,null,null,null,"","",null,null,"","",null,null,"","",null,null,"",""]
[null,null,null,null,null,null,null,"","",null,null,"","",null,null,"","",null,null,"",""]
[null,null,null,null,null,null,null,"","",null,null,"","",null,null,"","",null,null,"",""]
[null,null,null,null,null,null,null,"","",null,null,"","",null,null,"","",null,null,"",""]
[null,null,null,null,null,null,null,"","",null,null,"","",null,null,"","",null,null,"",""]
[null,null,null,null,null,null,null,"","",null,null,"","",null,null,"","",null,null,"",""]
[null,null,null,null,null,null,null,"","",null,null,"","",null,null,"","",null,null,"",""]
[null,null,null,null,null,null,null,"","",null,null,"","",null,null,"","",null,null,"",""]
[null,null,null,null,null,null,null,"","",null,null,"","",null,null,"","",null,null,"",""]
[null,null,null,null,null,null,null,"","",null,null,"","",null,null,"","",null,null,"",""]
[null,null,null,null,null,null,null,"","",null,null,"","",null,null,"","",null,null,"",""]
[null,null,null,null,null,null,null,"","",null,null,"","",null,null,"","",null,null,"",""]
[null,null,null,null,null,null,null,"","",null,null,"","",null,null,"","",null,null,"",""]
[null,null,null,null,null,null,null,"","",null,null,"","",null,null,"","",null,null,"",""]
[null,null,null,null,null,null,null,"","",null,null,"","",null,null,"","",null,null,"",""]
[null,null,null,null,null,null,null,"","",null,null,"","",null,null,"","",null,null,"",""]
[null,null,null,null,null,null,null,"","",null,null,"","",null,null,"","",null,null,"",""]
[null,null,null,null,null,null,null,"","",null,null,"","",null,null,"","",null,null,"",""]
[null,null,null,null,null,null,null,"","",null,null,"","",null,null,"","",null,null,"",""]
[null,null,null,null,null,null,null,"","",null,null,"","",null,null,"","",null,null,"",""]
[null,null,null,null,null,null,null,"","",null,null,"","",null,null,"","",null,null,"",""]
[null,null,null,null,null,null,null,"","",null,null,"","",null,null,"","",null,null,"",""]
[null,null,null,null,null,null,null,"","",null,null,"","",null,null,"","",null,null,"",""]
[null,null,null,null,null,null,null,"","",null,null,"","",null,null,"","",null,null,"",""]
[null,null,null,null,null,null,null,"","",null,null,"","",null,null,"","",null,null,"",""]
[null,null,null,null,null,null,null,"","",null,null,"","",null,null,"","",null,null,"",""]
[null,null,null,null,null,null,null,"","",null,null,"","",null,null,"","",null,null,"",""]
[null,null,null,null,null,null,null,"","",null,null,"","",null,null,"","",null,null,"",""]
[null,null,null,null,null,null,null,"","",null,null,"","",null,null,"","",null,null,"",""]
[null,null,null,null,null,null,null,"","",null,null,"","",null,null,"","",null,null,"",""]
[null,null,null,null,null,null,null,"","",null,null,"","",null,null,"","",null,null,"",""]
[null,null,null,null,null,null,null,"","",null,null,"","",null,null,"","",null,null,"",""]
[null,null,null,null,null,null,null,"","",null,null,"","",null,null,"","",null,null,"",""]
[null,null,null,null,null,null,null,"","",null,null,"","",null,null,"","",null,null,"",""]
[null,null,null,null,null,null,null,"","",null,null,"","",null,null,"","",null,null,"",""]
[null,null,null,null,null,null,null,"","",null,null,"","",null,null,"","",null,null,"",""]
[null,null,null,null,null,null,null,"","",null,null,"","",null,null,"","",null,null,"",""]
[null,null,null,null,null,null,null,"","",null,null,"","",null,null,"","",null,null,"",""]
[null,null,null,null,null,null,null,"","",null,null,"","",null,null,"","",null,null,"",""]
[null,null,null,null,null,null,null,"","",null,null,"","",null,null,"","",null,null,"",""]
[null,null,null,null,null,null,null,"","",null,null,"","",null,null,"","",null,null,"",""]
[null,null,null,null,null,null,null,"","",null,null,"","",null,null,"","",null,null,"",""]
[null,null,null,null,null,null,null,"","",null,null,"","",null,null,"","",null,null,"",""]
[null,null,null,null,null,null,null,"","",null,null,"","",null,null,"","",null,null,"",""]
[null,null,null,null,null,null,null,"","",null,null,"","",null,null,"","",null,null,"",""]
[null,null,null,null,null,null,null,"","",null,null,"","",null,null,"","",null,null,"",""]
[null,null,null,null,null,null,null,"","",null,null,"","",null,null,"","",null,null,"",""]
[null,null,null,null,null,null,null,"","",null,null,"","",null,null,"","",null,null,"",""]
[null,null,null,null,null,null,null,"","",null,null,"","",null,null,"","",null,null,"",""]
[null,null,null,null,null,null,null,"","",null,null,"","",null,null,"","",null,null,"",""]
[null,null,null,null,null,null,null,"","",null,null,"","",null,null,"","",null,null,"",""]
[null,null,null,null,null,null,null,"","",null,null,"","",null,null,"","",null,null,"",""]
[null,null,null,null,null,null,null,"","",null,null,"","",null,null,"","",null,null,"",""]
[null,null,null,null,null,null,null,"","",null,null,"","",null,null,"","",null,null,"",""]
[null,null,null,null,null,null,null,"","",null,null,"","",null,null,"","",null,null,"",""]
[null,null,null,null,null,null,null,"","",null,null,"","",null,null,"","",null,null,"",""]
[null,null,null,null,null,null,null,"","",null,null,"","",null,null,"","",null,null,"",""]
[null,null,null,null,null,null,null,"","",null,null,"","",null,null,"","",null,null,"",""]
[null,null,null,null,null,null,null,"","",null,null,"","",null,null,"","",null,null,"",""]
[null,null,null,null,null,null,null,"","",null,null,"","",null,null,"","",null,null,"",""]
[null,null,null,null,null,null,null,"","",null,null,"","",null,null,"","",null,null,"",""]
[null,null,null,null,null,null,null,"","",null,null,"","",null,null,"","",null,null,"",""]
[null,null,null,null,null,null,null,"","",null,null,"","",null,null,"",""]
[null,null,null,null,null,null,null,"","",null,null,"","",null,null,"",""]
[null,null,null,null,null,null,null,"","",null,null,"","",null,null,"",""]
[null,null,null,null,null,null,null,"","",null,null,"","",null,null,"",""]
[null,null,null,null,null,null,null,"","",null,null,"","",null,null,"",""]
[null,null,null,null,null,null,null,"","",null,null,"","",null,null,"",""]
[null,null,null,null,null,null,null,"","",null,null,"","",null,null,"",""]
[null,null,null,null,null,null,null,"","",null,null,"","",null,null,"",""]
[null,null,null,null,null,null,null,"","",null,null,"","",null,null,"",""]
[null,null,null,null,null,null,null,"","",null,null,"","",null,null,"",""]
[null,null,null,null,null,null,null,"","",null,null,"","",null,null,"",""]
[null,null,null,null,null,null,null,"","",null,null,"","",null,null,"",""]
[null,null,null,null,null,null,null,"","",null,null,"","",null,null,"",""]
[null,null,null,null,null,null,null,"","",null,null,"","",null,null,"",""]
[null,null,null,null,null,null,null,"","",null,null,"","",null,null,"",""]
[null,null,null,null,null,null,null,"","",null,null,"","",null,null,"",""]
[null,null,null,null,null,null,null,"","",null,null,"","",null,null,"",""]
[null,null,null,null,null,null,null,"","",null,null,"","",null,null,"",""]
[null,null,null,null,null,null,null,"","",null,null,"","",null,null,"",""]
[null,null,null,null,null,null,null,"","",null,null,"","",null,null,"",""]
[null,null,null,null,null,null,null,"","",null,null,"","",null,null,"",""]
[null,null,null,null,null,null,null,"","",null,null,"","",null,null,"",""]
[null,null,null,null,null,null,null,"","",null,null,"","",null,null,"",""]
[null,null,null,null,null,null,null,"","",null,null,"","",null,null,"",""]
[null,null,null,null,null,null,null,"","",null,null,"","",null,null,"",""]
[null,null,null,null,null,null,null,"","",null,null,"","",null,null,"",""]
[null,null,null,null,null,null,null,"","",null,null,"","",null,null,"",""]
[null,null,null,null,null,null,null,"","",null,null,"","",null,null,"",""]
[null,null,null,null,null,null,null,"","",null,null,"","",null,null,"",""]
[null,null,null,null,null,null,null,"","",null,null,"","",null,null,"",""]
[null,null,null,null,null,null,null,"","",null,null,"","",null,null,"",""]
[null,null,null,null,null,null,null,"","",null,null,"","",null,null,"",""]
[null,null,null,null,null,null,null,"","",null,null,"","",null,null,"",""]
[null,null,null,null,null,null,null,"","",null,null,"","",null,null,"",""]
[null,null,null,null,null,null,null,"","",null,null,"","",null,null,"",""]
[null,null,null,null,null,null,null,"","",null,null,"","",null,null,"",""]
[null,null,null,null,null,null,null,"","",null,null,"","",null,null,"",""]
[null,null,null,null,null,null,null,"","",null,null,"","",null,null,"",""]
[null,null,null,null,null,null,null,"","",null,null,"","",null,null,"",""]
[null,null,null,null,null,null,null,"","",null,null,"","",null,null,"",""]
[null,null,null,null,null,null,null,"","",null,null,"","",null,null,"",""]
[null,null,null,null,null,null,null,"","",null,null,"","",null,null,"",""]
[null,null,null,null,null,null,null,"","",null,null,"","",null,null,"",""]
[null,null,null,null,null,null,null,"","",null,null,"","",null,null,"",""]
[null,null,null,null,null,null,null,"","",null,null,"","",null,null,"",""]
[null,null,null,null,null,null,null,"","",null,null,"","",null,null,"",""]
[null,null,null,null,null,null,null,"","",null,null,"","",null,null,"",""]
[null,null,null,null,null,null,null,"","",null,null,"","",null,null,"",""]
[null,null,null,null,null,null,null,"","",null,null,"","",null,null,"",""]
[null,null,null,null,null,null,null,"","",null,null,"","",null,null,"",""]
[null,null,null,null,null,null,null,"","",null,null,"","",null,null,"",""]
[null,null,null,null,null,null,null,"","",null,null,"","",null,null,"",""]
[null,null,null,null,null,null,null,"","",null,null,"","",null,null,"",""]
[null,null,null,null,null,null,null,"","",null,null,"","",null,null,"",""]
[null,null,null,null,null,null,null,"","",null,null,"","",null,null,"",""]
[null,null,null,null,null,null,null,"","",null,null,"","",null,null,"",""]
[null,null,null,null,null,null,null,"","",null,null,"","",null,null,"",""]
[null,null,null,null,null,null,null,"","",null,null,"","",null,null,"",""]
[null,null,null,null,null,null,null,"","",null,null,"","",null,null,"",""]
[null,null,null,null,null,null,null,"","",null,null,"","",null,null,"",""]
[null,null,null,null,null,null,null,"","",null,null,"","",null,null,"",""]
[null,null,null,null,null,null,null,"","",null,null,"","",null,null,"",""]
[null,null,null,null,null,null,null,"","",null,null,"","",null,null,"",""]
[null,null,null,null,null,null,null,"","",null,null,"","",null,null,"",""]
[null,null,null,null,null,null,null,"","",null,null,"","",null,null,"",""]
[null,null,null,null,null,null,null,"","",null,null,"","",null,null,"",""]
[null,null,null,null,null,null,null,"","",null,null,"","",null,null,"",""]
[null,null,null,null,null,null,null,"","",null,null,"","",null,null,"",""]
[null,null,null,null,null,null,null,"","",null,null,"","",null,null,"",""]
[null,null,null,null,null,null,null,"","",null,null,"","",null,null,"",""]
[null,null,null,null,null,null,null,"","",null,null,"","",null,null,"",""]
[null,null,null,null,null,null,null,"","",null,null,"","",null,null,"",""]
[null,null,null,null,null,null,null,"","",null,null,"","",null,null,"",""]
[null,null,null,null,null,null,null,"","",null,null,"","",null,null,"",""]
[null,null,null,null,null,null,null,"","",null,null,"","",null,null,"",""]
[null,null,null,null,null,null,null,"","",null,null,"","",null,null,"",""]
[null,null,null,null,null,null,null,"","",null,null,"","",null,null,"",""]
[null,null,null,null,null,null,null,"","",null,null,"","",null,null,"",""]
[null,null,null,null,null,null,null,"","",null,null,"","",null,null,"",""]
[null,null,null,null,null,null,null,"","",null,null,"","",null,null,"",""]
[null,null,null,null,null,null,null,"","",null,null,"","",null,null,"",""]
[null,null,null,null,null,null,null,"","",null,null,"","",null,null,"",""]
[null,null,null,null,null,null,null,"","",null,null,"","",null,null,"",""]
[null,null,null,null,null,null,null,"","",null,null,"","",null,null,"",""]
[null,null,null,null,null,null,null,"","",null,null,"","",null,null,"",""]
[null,null,null,null,null,null,null,"","",null,null,"","",null,null,"",""]
[null,null,null,null,null,null,null,"","",null,null,"","",null,null,"",""]
[null,null,null,null,null,null,null,"","",null,null,"","",null,null,"",""]
[null,null,null,null,null,null,null,"","",null,null,"","",null,null,"",""]
[null,null,null,null,null,null,null,"","",null,null,"","",null,null,"",""]
[null,null,null,null,null,null,null,"","",null,null,"","",null,null,"",""]
[null,null,null,null,null,null,null,"","",null,null,"","",null,null,"",""]
[null,null,null,null,null,null,null,"","",null,null,"","",null,null,"",""]
[null,null,null,null,null,null,null,"","",null,null,"","",null,null,"",""]
[null,null,null,null,null,null,null,"","",null,null,"","",null,null,"",""]
[null,null,null,null,null,null,null,"","",null,null,"","",null,null,"",""]
[null,null,null,null,null,null,null,"","",null,null,"","",null,null,"",""]
[null,null,null,null,null,null,null,"","",null,null,"","",null,null,"",""]
[null,null,null,null,null,null,null,"","",null,null,"","",null,null,"",""]
[null,null,null,null,null,null,null,"","",null,null,"","",null,null,"",""]
[null,null,null,null,null,null,null,"","",null,null,"","",null,null,"",""]
[null,null,null,null,null,null,null,"","",null,null,"","",null,null,"",""]
[null,null,null,null,null,null,null,"","",null,null,"","",null,null,"",""]
[null,null,null,null,null,null,null,"","",null,null,"","",null,null,"",""]
[null,null,null,null,null,null,null,"","",null,null,"","",null,null,"",""]
[null,null,null,null,null,null,null,"","",null,null,"","",null,null,"",""]
[null,null,null,null,null,null,null,"","",null,null,"","",null,null,"",""]
[null,null,null,null,null,null,null,"","",null,null,"","",null,null,"",""]
[null,null,null,null,null,null,null,"","",null,null,"","",null,null,"",""]
[null,null,null,null,null,null,null,"","",null,null,"","",null,null,"",""]
[null,null,null,null,null,null,null,"","",null,null,"","",null,null,"",""]
[null,null,null,null,null,null,null,"","",null,null,"","",null,null,"",""]
[null,null,null,null,null,null,null,"","",null,null,"","",null,null,"",""]
[null,null,null,null,null,null,null,"","",null,null,"","",null,null,"",""]
[null,null,null,null,null,null,null,"","",null,null,"","",null,null,"",""]
[null,null,null,null,null,null,null,"","",null,null,"","",null,null,"",""]
[null,null,null,null,null,null,null,"","",null,null,"","",null,null,"",""]
[null,null,null,null,null,null,null,"","",null,null,"","",null,null,"",""]
[null,null,null,null,null,null,null,"","",null,null,"","",null,null,"",""]
[null,null,null,null,null,null,null,"","",null,null,"","",null,null,"",""]
[null,null,null,null,null,null,null,"","",null,null,"","",null,null,"",""]
[null,null,null,null,null,null,null,"","",null,null,"","",null,null,"",""]
[null,null,null,null,null,null,null,"","",null,null,"","",null,null,"",""]
[null,null,null,null,null,null,null,"","",null,null,"","",null,null,"",""]
[null,null,null,null,null,null,null,"","",null,null,"","",null,null,"",""]
[null,null,null,null,null,null,null,"","",null,null,"","",null,null,"",""]
[null,null,null,null,null,null,null,"","",null,null,"","",null,null,"",""]
[null,null,null,null,null,null,null,"","",null,null,"","",null,null,"",""]
[null,null,null,null,null,null,null,"","",null,null,"","",null,null,"",""]
[null,null,null,null,null,null,null,"","",null,null,"","",null,null,"",""]
[null,null,null,null,null,null,null,"","",null,null,"","",null,null,"",""]
[null,null,null,null,null,null,null,"","",null,null,"","",null,null,"",""]
[null,null,null,null,null,null,null,"","",null,null,"","",null,null,"",""]
[null,null,null,null,null,null,null,"","",null,null,"","",null,null,"",""]
[null,null,null,null,null,null,null,"","",null,null,"","",null,null,"",""]
[null,null,null,null,null,null,null,"","",null,null,"","",null,null,"",""]
[null,null,null,null,null,null,null,"","",null,null,"","",null,null,"",""]
[null,null,null,null,null,null,null,"","",null,null,"","",null,null,"",""]
[null,null,null,null,null,null,null,"","",null,null,"","",null,null,"",""]
[null,null,null,null,null,null,null,"","",null,null,"","",null,null,"",""]
[null,null,null,null,null,null,null,"","",null,null,"","",null,null,"",""]
[null,null,null,null,null,null,null,"","",null,null,"","",null,null,"",""]
[null,null,null,null,null,null,null,"","",null,null,"","",null,null,"",""]
[null,null,null,null,null,null,null,"","",null,null,"","",null,null,"",""]
[null,null,null,null,null,null,null,"","",null,null,"","",null,null,"",""]
[null,null,null,null,null,null,null,"","",null,null,"","",null,null,"",""]
[null,null,null,null,null,null,null,"","",null,null,"","",null,null,"",""]
[null,null,null,null,null,null,null,"","",null,null,"","",null,null,"",""]
[null,null,null,null,null,null,null,"","",null,null,"","",null,null,"",""]
[null,null,null,null,null,null,null,"","",null,null,"","",null,null,"",""]
[null,null,null,null,null,null,null,"","",null,null,"","",null,null,"",""]
[null,null,null,null,null,null,null,"","",null,null,"","",null,null,"",""]
[null,null,null,null,null,null,null,"","",null,null,"","",null,null,"",""]
[null,null,null,null,null,null,null,"","",null,null,"","",null,null,"",""]
[null,null,null,null,null,null,null,"","",null,null,"","",null,null,"",""]
[null,null,null,null,null,null,null,"","",null,null,"","",null,null,"",""]
[null,null,null,null,null,null,null,"","",null,null,"","",null,null,"",""]
[null,null,null,null,null,null,null,"","",null,null,"","",null,null,"",""]
[null,null,null,null,null,null,null,"","",null,null,"","",null,null,"",""]
[null,null,null,null,null,null,null,"","",null,null,"","",null,null,"",""]
[null,null,null,null,null,null,null,"","",null,null,"","",null,null,"",""]
[null,null,null,null,null,null,null,"","",null,null,"","",null,null,"",""]
[null,null,null,null,null,null,null,"","",null,null,"","",null,null,"",""]
[null,null,null,null,null,null,null,"","",null,null,"","",null,null,"",""]
[null,null,null,null,null,null,null,"","",null,null,"","",null,null,"",""]
[null,null,null,null,null,null,null,"","",null,null,"","",null,null,"",""]
[null,null,null,null,null,null,null,"","",null,null,"","",null,null,"",""]
[null,null,null,null,null,null,null,"","",null,null,"","",null,null,"",""]
[null,null,null,null,null,null,null,"","",null,null,"","",null,null,"",""]
[null,null,null,null,null,null,null,"","",null,null,"","",null,null,"",""]
[null,null,null,null,null,null,null,"","",null,null,"","",null,null,"",""]
[null,null,null,null,null,null,null,"","",null,null,"","",null,null,"",""]
[null,null,null,null,null,null,null,"","",null,null,"","",null,null,"",""]
[null,null,null,null,null,null,null,"","",null,null,"","",null,null,"",""]
[null,null,null,null,null,null,null,"","",null,null,"","",null,null,"",""]
[null,null,null,null,null,null,null,"","",null,null,"","",null,null,"",""]
[null,null,null,null,null,null,null,"","",null,null,"","",null,null,"",""]
[null,null,null,null,null,null,null,"","",null,null,"","",null,null,"",""]
[null,null,null,null,null,null,null,"","",null,null,"","",null,null,"",""]
[null,null,null,null,null,null,null,"","",null,null,"","",null,null,"",""]
[null,null,null,null,null,null,null,"","",null,null,"","",null,null,"",""]
[null,null,null,null,null,null,null,"","",null,null,"","",null,null,"",""]
[null,null,null,null,null,null,null,"","",null,null,"","",null,null,"",""]
[null,null,null,null,null,null,null,"","",null,null,"","",null,null,"",""]
[null,null,null,null,null,null,null,"","",null,null,"","",null,null,"",""]
[null,null,null,null,null,null,null,"","",null,null,"","",null,null,"",""]
[null,null,null,null,null,null,null,"","",null,null,"","",null,null,"",""]
[null,null,null,null,null,null,null,"","",null,null,"","",null,null,"",""]
[null,null,null,null,null,null,null,"","",null,null,"","",null,null,"",""]
[null,null,null,null,null,null,null,"","",null,null,"","",null,null,"",""]
[null,null,null,null,null,null,null,"","",null,null,"","",null,null,"",""]
[null,null,null,null,null,null,null,"","",null,null,"","",null,null,"",""]
[null,null,null,null,null,null,null,"","",null,null,"","",null,null,"",""]
[null,null,null,null,null,null,null,"","",null,null,"","",null,null,"",""]
[null,null,null,null,null,null,null,"","",null,null,"","",null,null,"",""]
[null,null,null,null,null,null,null,"","",null,null,"","",null,null,"",""]
[null,null,null,null,null,null,null,"","",null,null,"","",null,null,"",""]
[null,null,null,null,null,null,null,"","",null,null,"","",null,null,"",""]
[null,null,null,null,null,null,null,"","",null,null,"","",null,null,"",""]
[null,null,null,null,null,null,null,"","",null,null,"","",null,null,"",""]
[null,null,null,null,null,null,null,"","",null,null,"","",null,null,"",""]
[null,null,null,null,null,null,null,"","",null,null,"","",null,null,"",""]
[null,null,null,null,null,null,null,"","",null,null,"","",null,null,"",""]
[null,null,null,null,null,null,null,"","",null,null,"","",null,null,"",""]
[null,null,null,null,null,null,null,"","",null,null,"","",null,null,"",""]
[null,null,null,null,null,null,null,"","",null,null,"","",null,null,"",""]
[null,null,null,null,null,null,null,"","",null,null,"","",null,null,"",""]
[null,null,null,null,null,null,null,"","",null,null,"","",null,null,"",""]
[null,null,null,null,null,null,null,"","",null,null,"","",null,null,"",""]
[null,null,null,null,null,null,null,"",""]
[null,null,null,null,null,null,null,"",""]
[null,null,null,null,null,null,null,"",""]
[null,null,null,null,null,null,null,"",""]
[null,null,null,null,null,null,null,"",""]
[null,null,null,null,null,null,null,"",""]
[null,null,null,null,null,null,null,"",""]
[null,null,null,null,null,null,null,"",""]
[null,null,null,null,null,null,null,"",""]
[null,null,null,null,null,null,null,"",""]
[null,null,null,null,null,null,null,"",""]
[null,null,null,null,null,null,null,"",""]
[null,null,null,null,null,null,null,"",""]

{"sheet":"☆","index":2,"n_rows":529,"n_cols":41,"rows_kept":529,"cut":false,"hidden":false,"merged":[[1,1,1,3],[3,2,3,3],[4,2,5,3],[2,2,2,3],[10,2,10,3],[14,1,15,1],[12,1,13,1],[16,4,16,7],[16,8,16,9],[3,19,3,24],[4,19,4,24],[5,19,6,24],[2,7,11,9],[12,7,12,9],[14,4,15,4],[14,5,15,5],[14,6,15,6],[13,2,13,3],[13,7,13,9],[3,1,10,1],[12,2,12,3]]}
["盛土体積 計算条件",null,null,null,null,null,null,null,null,null,null,"※shift+gで体積の計算マクロだけ起動する。"]
[null,"項　　　目",null,null,"記号","値","単位","備考",null,null,null,null,null,"旧計算Vsoil","配置別底面積"]
[null,null,"改良体配置",null,null,"単軸四角形配置",null,"飛び出ないようにダミー入力",null,null,null,null,"単軸三角形配置",{"$f":"W19","v":15.527841003247225},{"$f":"INDIRECT(\"'\"&$M$3&\"'!\"&P3)","v":2.6449999999999996},"S26","Ｖsoil算出のための判定式及び適用式（単軸四角形配置）",null,null,null,null,null,null,null,null,null,null,null,null,null,"二軸四角形配置",null,null,null,null,"仕様の確認用グラフ"]
[null,"セメント\nコラム\n改良体","改良体直径",null,"ｄ",1,"m",null,null,null,null,null,"単軸四角形配置",{"$f":"+LOOKUP(Z9,Q5:Q7,AD5:AD7)","v":10.605783931178792},{"$f":"INDIRECT(\"'\"&$M$4&\"'!\"&P4)","v":5.2899999999999991},"R26",null,"盛土高さ",null,"改良体間荷重算定モデルと盛土高さとの関係",null,null,null,null,null,"判定式",null,"適用式","Ｖsoil","計算結果","適用式","Ｖsoil","計算結果","計算結果",null,"標準的な仕様範囲",null,null,"試験施工などで検討可能な範囲"]
[null,null,"改良体間隔\n (改良体中心間隔)",null,"a",2.2999999999999998,"〃",null,null,null,null,null,"二軸四角配置",{"$f":"+LOOKUP(Z9,Q5:Q7,AH5:AH7)","v":15.434981029095461},{"$f":"INDIRECT(\"'\"&$M$5&\"'!\"&P5)","v":{"$error":"#VALUE!"}},"S26",1,"Ｈe1以上",null,"改良体間荷重算定モデル土塊が全て盛土内",null,null,null,null,null,"Ｈe1≦Ｈe",null,"5.8","{(λ－ｄ)／2×λ^2－π×(λ^3－ｄ^3)／24＋(4－π)×(√2－1)／24×λ^3}×tanθ",{"$f":"((F9-F4)/2*F9^2-PI()*(F9^3-F4^3)/24+(4-PI())*(2^0.5-1)/24*F9^3)*TAN(RADIANS(F15))+(F10*(F9-F10))/4*((2^0.5+1)/2*F10+((F9/2)^2+(F10/2)^2)^0.5+F9/2-2*F4)*TAN(RADIANS(F15))","v":24.654614053344961},"p17 2007マニュアル","1/2(λ-d)・(λ-d)/2・tanθ・d/2・2＝",{"$f":"((1/2*(F9-F4))^2)*TAN(RADIANS(F15))*F4","v":4.8291970979166683},{"$f":"AD5+AG5","v":29.48381115126163},null,"d","λ","ap","d","λ","ap"]
[null,null,null,null,"b",2.2999999999999998,"〃",null,null,null,null,null,"二軸千鳥配置","※未対応",{"$f":"INDIRECT(\"'\"&$M$6&\"'!\"&P6)","v":0},"V26",2,"Ｈe2～Ｈe1",null,"改良体間荷重算定モデル土塊の上部が盛土上面にある",null,null,null,null,null,"Ｈe2＜Ｈe＜Ｈe1",null,"5.9","[(λ－ｄ)／2×λ^2－π×(λ^3－ｄ^3)／24＋【1-［{(0.5^2-d)tanθ-2Ｈe}／{(√2-1)×λ×tanθ}］^3】×(4－π)×(√2－1)／24×λ^3]×tanθ",{"$f":"+((F9-F4)/2*F9^2-PI()*(F9^3-F4^3)/24+(1-(((2^0.5*F9-F4)*TAN(RADIANS(F15))-2*W9)/(2^0.5-1)/F9/TAN(RADIANS(F15)))^3)*(4-PI())*(2^0.5-1)/24*F9^3)*TAN(RADIANS(F15))+(F10*(F9-F10))/4*((2^0.5+1)/2*F10+((F9/2)^2+(F10/2)^2)^0.5+F9/2-2*F4)*TAN(RADIANS(F15))","v":10.769889620175308},null,null,{"$f":"AG5","v":4.8291970979166683},{"$f":"AD6+AG6","v":15.599086718091975},null,0.6,1,{"$f":"+AJ6^2/4*PI()/AK6^2*100","v":28.274333882308138},0.6,1,{"$f":"+AM6^2/4*PI()/AN6/AN6*100","v":28.274333882308138}]
[null,null,{"$f":"IF(OR(F3=M6,F3=M5),\"分担面　横\",\"\")","v":""},null,{"$f":"IF(OR(F3=M6,F3=M5),\"L\",\"\")","v":""},{"$f":"IF(OR(F3=M6,F3=M5),F4+F6,\"\")","v":""},"〃",null,null,null,null,null,"計算に反映⇨",{"$f":"IF(F3=M6,N6,(LOOKUP(F3,M3:M5,N3:N5)))","v":10.605783931178792},null,null,3,"Ｈe2以下",null,null,null,null,null,null,null,"Ｈe≦Ｈe2",null,"5.10","λ^2×Ｈe－1／3×{π×(Ｈe／tanθ＋ｄ／2)^2×(ｄ／2tanθ×Ｈe)－π×(ｄ／2)^3×tanθ}",{"$f":"+F9*F9*W9-1/3*(PI()*(W9/TAN(RADIANS(F15))+F4/2)^2*(F4/2*TAN(RADIANS(F15))+W9)-PI()*(F4/2)^3*TAN(RADIANS(F15)))+(F10*(F9-F10))/4*((2^0.5+1)/2*F10+((F9/2)^2+(F10/2)^2)^0.5+F9/2-2*F4)*TAN(RADIANS(F15))","v":10.605783931178792},null,null,{"$f":"AG5","v":4.8291970979166683},{"$f":"AD7+AG7","v":15.434981029095461},null,1,1,{"$f":"+AJ7^2/4*PI()/AK7^2*100","v":78.539816339744831},1,1,{"$f":"+AM7^2/4*PI()/AN7/AN7*100","v":78.539816339744831}]
[null,null,{"$f":"IF(F3=M6,\"分担面　縦\",\"\")","v":""},null,{"$f":"IF(F3=M6,\"h\",\"\")","v":""},null,"〃",null,null,null,null,null,null,3.6314237356451375,null,null,null,null,null,null,null,null,null,null,null,null,null,null,null,null,null,null,null,null,null,1.3,1.3,{"$f":"+AJ8^2/4*PI()/AK8^2*100","v":78.539816339744831},1.3,1.3,{"$f":"+AM8^2/4*PI()/AN8^2*100","v":78.539816339744831}]
[null,null,{"$f":"IF(OR(F3=M5,F3=M4),\"改良体間隔(大)\",\"\")","v":"改良体間隔(大)"},null,{"$f":"IF(OR(F3=M5,F3=M4),\"λ\",\"\")","v":"λ"},{"$f":"IF(OR(F3=M5,F3=M4),MAX(F5:F6),\"\")","v":2.2999999999999998},"〃",null,null,null,null,null,null,null,null,null,null,"Ｈe：","盛土高さ",null,null,"Ｈe＝",{"$f":"+F13","v":2.59},"m","判定：",{"$f":"+IF(W9>=W10,1,IF(W9<=W11,3,2))","v":3},null,null,null,null,null,null,null,null,null,1.3,2.5,{"$f":"+AJ9^2/4*PI()/AK9^2*100","v":21.237166338267002},1.8,1.8,{"$f":"+AM9^2/4*PI()/AN9^2*100","v":78.539816339744831}]
[null,null,{"$f":"IF(OR(F3=M5,F3=M4),\"改良体間隔(小)\",\"\")","v":"改良体間隔(小)"},null,{"$f":"IF(OR(F3=M5,F3=M4),\"x\",\"\")","v":"x"},{"$f":"IF(OR(F3=M5,F3=M4),MIN(F5:F6),\"\")","v":2.2999999999999998},"〃",null,null,null,null,"盛土高",null,null,null,null,null,"Ｈe1：","{(√2・λ－ｄ)tanθ}／2",null,null,"Ｈe1＝",{"$f":"+((SQRT(2)*F5-F4)*TAN(RADIANS(F15))/2)","v":12.874189081598088},"m",null,null,null,null,null,null,null,null,null,null,null,{"$f":"+SQRT(AL10/100*4/PI()*AK10*AK10)","v":0.89206205807638561},2.5,10,1.8,3.25,{"$f":"+AM10^2/4*PI()/AN10/AN10*100","v":24.091740112735931}]
[null,null,"改良率",null,"ａp",{"$f":"INDIRECT(\"'\"&$F$3&\"'!\"&O11)","v":0.14799999999999999},"-",null,null,null,null,"計画高","原地盤高","盛土高","F8",null,null,"Ｈe2：","{(λ－ｄ)tanθ}／2",null,null,"Ｈe2＝",{"$f":"+((F5-F4)*TAN(RADIANS(F15))/2)","v":7.4295339967948753},"m",null,null,null,null,null,null,null,null,null,null,null,0.6,{"$f":"+SQRT((AJ11^2/4*PI())/(AL11/100))","v":1.6814973649193785},10,{"$f":"+SQRT(AO11/100*4/PI()*AN11*AN11)","v":0.98692869637193126},3,8.5]
[null,{"$f":"IF(AND(F3=M6,F4<>F5),\"※注意①a=dに設定してください!\",IF(AND(F3<>M6,F8<>\"\"),\"※注意③F8を空欄に設定してください!\",\"\"))","v":""},null,null,{"$f":"IF(AND(F3=M6,F8=\"\"),\"※注意➁高さhを設定してください!\",\"\")","v":""},null,null,null,null,null,null,2.59,0,{"$f":"+L12-M12","v":2.59},null,null,null,null,null,null,null,null,null,null,null,null,null,null,null,null,null,null,null,null,null,{"$f":"+AJ6","v":0.6},{"$f":"+AK6","v":1},{"$f":"+AL6","v":28.274333882308138},0.6,{"$f":"+SQRT((AM12^2/4*PI())/(AO12/100))","v":1.8238399659641238},8.5]
[null,"盛土条件","盛土高さ",null,"Ｈe",{"$f":"+N12","v":2.59},"m",{"$f":"+IF(AND(L12=\"\",M12=\"\"),\"\",\"ＦH＝\"&FIXED(L12,2)&\"m，ＧL＝\"&FIXED(M12,2)&\"m\")","v":"ＦH＝2.59m，ＧL＝0.00m"},null,null,null,null,null,null,null,null,"Ｖsoil算出のための判定式及び適用式（⇒単軸千鳥？or単軸三角形配置）",null,null,null,null,null,null,null,null,null,null,null,null,null,null,null,null,null,null,null,null,null,{"$f":"+AM6","v":0.6},{"$f":"+AN6","v":1},{"$f":"+AO6","v":28.274333882308138}]
[null,null,"盛土の内部摩擦角",null,"φ",30,"度",null,null,null,null,"塑性角",{"$f":"+D15","v":"浮き型"},null,null,null,null,"d",{"$f":"F4","v":1},"D1",{"$f":"1/2*SQRT(S20^2+S15^2/4)","v":1.4084566021003273},"V1",{"$f":"0.5*S15*S20*U18","v":31.68839018390954},null,null,null,null,null,null,null,null,null,null,null,null,{"$f":"+AJ15","v":1},{"$f":"+AK33","v":0}]
[null,"塑性角","改良形式：","浮き型","θ",{"$f":"+IF(D16=L15,L16,IF(D16=M15,M16,IF(D16=N15,N16,\"\")))","v":85},"度",null,null,null,null,"ジオテキ","浅層改良","なし","塑性角予備",null,null,"λ",{"$f":"F6","v":2.2999999999999998},"D2",{"$f":"U14-S14/2","v":0.9084566021003273},"V2",{"$f":"(S23^2*((U18+U23)-S14^2/4*U23))*S19/3/2","v":4.3455369003252402},null,null,null,null,null,null,null,null,null,null,null,null,{"$f":"+F4","v":1},{"$f":"+MAX(F5:F6)","v":2.2999999999999998}]
[null,null,"補助工法：","浅層改良",null,null,null,null,null,null,null,{"$f":"+IF(M14=\"浮き型\",75,55)","v":75},{"$f":"+IF(M14=\"浮き型\",85,75)","v":85},{"$f":"+IF(M14=\"浮き型\",80,90-$F$14)","v":80},{"$f":"+IF(D16=L15,L16,IF(D16=M15,M16,IF(D16=N15,N16,\"\")))","v":85},null,null,"a",{"$f":"F5","v":2.2999999999999998},"D3",{"$f":"S15/2","v":1.1499999999999999},"V3",{"$f":"(S23^2*((U18+U23)-S14^2/4*U23))*S17/3/2","v":5.9430413996720581},null,null,null,null,null,null,null,null,null,null,null,null,{"$f":"+AJ35","v":0},{"$f":"+AK15","v":2.2999999999999998}]
[null,"影響円D","影響円直径D","その時の高さ","影響円Dの範囲条件",null,null,null,"概要",null,null,null,null,null,null,null,null,"α",{"$f":"PI()-S18-3/2*S19","v":1.1502619915109311},"D4",{"$f":"U16-S14/2","v":0.64999999999999991},"V4",{"$f":"(S18/2*(S23^2)-0.5*(U14^2)*TAN(S18))*2*U21/3","v":-0.53698543869495496}]
[null,{"$f":"INDIRECT(\"'\"&$C$24&\"'!\"&L18)","v":"d"},1,0,"STEP-0：底面積（d=D）",null,null,null,"底面積A0",null,null,"B17","C17","D17","U5",null,null,"β",{"$f":"ATAN((-(S15^2)+4*(S20^2))/(4*S15*S20))","v":0.72972765622696645},"h1",{"$f":"(S23-S14/2)*TAN(RADIANS(F15))","v":10.715674033838761},"V5",{"$f":"(S19/4*(S23^2)-0.5*(U16^2)*TAN(S19/2))*2/3*U22","v":0.30402797885099719}]
[null,"b",2.2999999999999998,7.4295339967948753,"STEP-1：影響円D範囲(d≦D<b）",null,null,null,"底面積A1",null,null,"B18","C18","D18","U6",null,null,"γ",{"$f":"2*ATAN(S15/2/S20)","v":0.84106867056793022},"h2",{"$f":"(U15-S14/2)*TAN(RADIANS(F15))","v":4.6686803254149218},"Vsoil",{"$f":"W14-(W15+2*W16-W17-2*W18)","v":15.527841003247225}]
[null,"a",2.3001,7.4301054994100149,"STEP-2：影響円D範囲(b≦D<a）",null,null,null,"底面積A2",null,null,"B19","C19","D19","U7",null,null,"μ",{"$f":"SQRT(S15^2+(S16/2)^2)","v":2.5714781741247581},"h3",{"$f":"(U16-S14/2)*TAN(RADIANS(F15))","v":7.4295339967948753}]
[null,"√(a2+b2）",3.2526911934581184,12.874189081598088,"STEP-3：影響円D範囲(a≦D<√(a^2+b^2））",null,null,null,"底面積A3",null,null,"B20","C20","D20","U8",null,null,"s",{"$f":"(S15+2*S20)/2","v":3.721478174124758},"h4",{"$f":"U18-U19","v":6.0469937084238392}]
[null,"---","---","end","計算範囲外",null,null,null,{"$f":"IF(D22=\"end\",\"\",\"底面積A4\")","v":""},null,null,"B21","C21","D21","U9",null,null,"4√｛(s(s-λ)(s-μ)(ｓ-c)｝",{"$f":"4*SQRT(S21*(S21-S15)*(S21-S20)*(S21-S20))","v":10.58},"h5",{"$f":"U18-U20","v":3.2861400370438858}]
["体積の算出",null,null,null,null,null,null,null,null,null,null,null,null,null,null,null,null,"外接円R",{"$f":"S15*S20*S20/S22","v":1.4374999999999998},"h6",{"$f":"S14/2*TAN(RADIANS(F15))","v":5.7150261513806742}]
[null,"配置型式",{"$f":"F3","v":"単軸四角形配置"}]
[null,"スタート",{"$f":"M12","v":0},"m",null,"step数",{"$f":"INDIRECT(\"'\"&$C$24&\"'!\"&L25)","v":"STEP-1：影響円D範囲(d≦D<b）"},null,null,null,null,"AB23"]
[null,"エンド",{"$f":"L12","v":2.59},"m",null,"高さH",null,null,2.59,"m"]
[null,"キザミ",{"$f":"C29","v":8.6333333333333331E-2},"m",30,"面積",null,null,{"$f":"INDIRECT(\"'\"&$C$24&\"'!\"&L27)","v":3.6314237356451375},"m2",null,"AA23"]
[null,"回数",{"$f":"INT((C26-C25)/C27)+2","v":32},"回",null,"体積",null,null,{"$f":"I46","v":10.605706563606438},"m3"]
[null,"参考キザミ幅",{"$f":"IF(C26>=L37,L37/E27,C26/E27)","v":8.6333333333333331E-2},"m"]
[]
["盛土計算各step上限地盤高さ",null,null,null,null,null,null,null,null,null,null,"D17"]
[null,"step0",{"$f":"INDIRECT(\"'\"&$C$24&\"'!\"&L31)","v":0},null,null,null,null,null,null,null,null,"D18"]
[null,"step1",{"$f":"INDIRECT(\"'\"&$C$24&\"'!\"&L32)","v":7.4295339967948753},null,null,null,null,null,null,null,null,"D19"]
[null,"step2",{"$f":"INDIRECT(\"'\"&$C$24&\"'!\"&L33)","v":7.4301054994100149},null,null,null,null,null,null,null,null,"D20"]
[null,"step3",{"$f":"INDIRECT(\"'\"&$C$24&\"'!\"&L34)","v":12.874189081598088},null,null,null,null,null,null,null,null,"D21"]
[null,"step4",{"$f":"INDIRECT(\"'\"&$C$24&\"'!\"&L35)","v":"end"},null,null,null,null,null,null,null,null,"⇩盛土高のキザミで、単軸と二軸の条件分けのため：参照先C29"]
[null,null,"end",null,null,null,null,null,null,null,null,{"$f":"IF(OR(M3=F3,M4=F3),C35,C36)","v":12.874189081598088}]
[]
[]
[]
[]
[null,"出力列№(step数）",null,2,null,null,null,null,null,null,null,null,null,null,null,null,null,null,null,null,"2.0m",null,null,null,null,"3.0m"]
[null,"出力列№\n(横軸）",null,6,null,null,null,null,null,null,null,null,null,null,null,null,"m2",null,null,null,null,"m2"]
[null,"出力列№\n(縦軸）",null,{"$f":"D43+1","v":7},null,"（参考）旧計算Vsoil=",{"$f":"IF(F3=M6,N6,FIXED(LOOKUP(F3,M3:M5,N3:N5),2)&\"(㎥)\")","v":"10.61(㎥)"},null,"∴新計算体積Vsoil=",{"$f":"FIXED(I46,2)&\"(㎥)\"","v":"10.61(㎥)"},null,null,null,null,"旧Vsoil",null,"m2",null,null,"旧Vsoil",1.1255458039720783,"m2",null,null,"旧Vsoil",1.125640300757583,"m2",null,null,"旧Vsoil",0.96954561148419738,"m2",null,null,"旧Vsoil",null,"m2"]
[null,null,null,null,null,null,null,"Asoil=",{"$f":"N8","v":3.6314237356451375},"m2",null,null,null,null,"Asoil=",null,null,null,null,"Asoil=",null,null,null,null,"Asoil=",null,"m2",null,null,"Asoil=",null,null,null,null,"Asoil=",null,"m2"]
["盛土体積【詳細】",null,{"$f":"COUNTA(B49:B1000)","v":32},null,null,null,null,"Vsoil=",{"$f":"SUM(I49:I1074)","v":10.605706563606438},"m2",null,null,null,null,"Vsoil=",{"$f":"SUM(P49:P1074)","v":0},null,null,null,"Vsoil=",{"$f":"SUM(U49:U1074)","v":0},null,null,null,"Vsoil=",{"$f":"SUM(Z49:Z1074)","v":0},"m2",null,null,"Vsoil=",{"$f":"SUM(AE49:AE1074)","v":0},"m2",null,null,"Vsoil=",{"$f":"SUM(AJ49:AJ1074)","v":0},"m2"]
[null,"表示列№",null,null,null,6,{"$f":"F47+1","v":7},8,9,null,null,{"$f":"I47+3","v":12},13,14,15,16,{"$f":"N47+3","v":17},{"$f":"Q47+1","v":18},{"$f":"R47+1","v":19},{"$f":"S47+1","v":20},{"$f":"T47+1","v":21},{"$f":"S47+3","v":22},{"$f":"V47+1","v":23},{"$f":"W47+1","v":24},{"$f":"X47+1","v":25},{"$f":"Y47+1","v":26},{"$f":"X47+3","v":27},{"$f":"AA47+1","v":28},{"$f":"AB47+1","v":29},{"$f":"AC47+1","v":30},{"$f":"AD47+1","v":31},{"$f":"AC47+3","v":32},{"$f":"AF47+1","v":33},{"$f":"AG47+1","v":34},{"$f":"AH47+1","v":35},{"$f":"AI47+1","v":36}]
[null,"凡例名",null,null,null,"高さH","面積","平均面積","体積",null,null,"凡例名","高さH","面積","平均面積","体積","凡例名","高さH","面積","平均面積","体積","凡例名","高さH","面積","平均面積","体積","凡例名","高さH","面積","平均面積","体積","凡例名","高さH","面積","平均面積","体積"]
[null,"STEP-0：底面積（d=D）",null,null,null,0,4.5046018366025509,{"$f":"IFERROR(AVERAGE(G49:G50),\"\")","v":4.4926477017647439},{"$f":"IFERROR(H49*(F50-F49),\"\")","v":0.38786525158568957},null,null,null,null,null,{"$f":"IFERROR(AVERAGE(N49:N50),\"\")","v":""},{"$f":"IFERROR(O49*(M50-M49),\"\")","v":""},null,null,null,{"$f":"IFERROR(AVERAGE(S49:S50),\"\")","v":""},{"$f":"IFERROR(T49*(R50-R49),\"\")","v":""},null,null,null,{"$f":"IFERROR(AVERAGE(X49:X50),\"\")","v":""},{"$f":"IFERROR(Y49*(W50-W49),\"\")","v":""},null,null,null,{"$f":"IFERROR(AVERAGE(AC49:AC50),\"\")","v":""},{"$f":"IFERROR(AD49*(AB50-AB49),\"\")","v":""},null,null,null,{"$f":"IFERROR(AVERAGE(AH49:AH50),\"\")","v":""},{"$f":"IFERROR(AI49*(AG50-AG49),\"\")","v":""}]
[null,"STEP-1：影響円D範囲(d≦D<b）",null,null,null,8.6333333333333331E-2,4.4806935669269379,{"$f":"IFERROR(AVERAGE(G50:G51),\"\")","v":4.4685602021917878},{"$f":"IFERROR(H50*(F51-F50),\"\")","v":0.38578569745589103},null,null,null,null,null,{"$f":"IFERROR(AVERAGE(N50:N51),\"\")","v":""},{"$f":"IFERROR(O50*(M51-M50),\"\")","v":""},null,null,null,{"$f":"IFERROR(AVERAGE(S50:S51),\"\")","v":""},{"$f":"IFERROR(T50*(R51-R50),\"\")","v":""},null,null,null,{"$f":"IFERROR(AVERAGE(X50:X51),\"\")","v":""},{"$f":"IFERROR(Y50*(W51-W50),\"\")","v":""},null,null,null,{"$f":"IFERROR(AVERAGE(AC50:AC51),\"\")","v":""},{"$f":"IFERROR(AD50*(AB51-AB50),\"\")","v":""},null,null,null,{"$f":"IFERROR(AVERAGE(AH50:AH51),\"\")","v":""},{"$f":"IFERROR(AI50*(AG51-AG50),\"\")","v":""}]
[null,"STEP-1：影響円D範囲(d≦D<b）",null,null,null,0.17266666666666666,4.4564268374566378,4.4441142428241438,0.38367519629715113,null,null,null,null,null,"","",null,null,null,"","",null,null,null,"","",null,null,null,"","",null,null,null,"",""]
[null,"STEP-1：影響円D範囲(d≦D<b）",null,null,null,0.25900000000000001,4.4318016481916507,4.4193098236618127,0.38153374810946977,null,null,null,null,null,"","",null,null,null,"","",null,null,null,"","",null,null,null,"","",null,null,null,"",""]
[null,"STEP-1：影響円D範囲(d≦D<b）",null,null,null,0.34533333333333333,4.4068179991319756,4.3941469447047945,0.37936135289284717,null,null,null,null,null,"","",null,null,null,"","",null,null,null,"","",null,null,null,"","",null,null,null,"",""]
[null,"STEP-1：影響円D範囲(d≦D<b）",null,null,null,0.43166666666666664,4.3814758902776134,4.3686256059530884,0.37715801064728349,null,null,null,null,null,"","",null,null,null,"","",null,null,null,"","",null,null,null,"","",null,null,null,"",""]
[null,"STEP-1：影響円D範囲(d≦D<b）",null,null,null,0.51800000000000002,4.3557753216285633,4.3427458074066951,0.37492372137277818,null,null,null,null,null,"","",null,null,null,"","",null,null,null,"","",null,null,null,"","",null,null,null,"",""]
[null,"STEP-1：影響円D範囲(d≦D<b）",null,null,null,0.60433333333333339,4.3297162931848261,4.316507549065614,0.37265848506933152,null,null,null,null,null,"","",null,null,null,"","",null,null,null,"","",null,null,null,"","",null,null,null,"",""]
[null,"STEP-1：影響円D範囲(d≦D<b）",null,null,null,0.69066666666666676,4.3032988049464009,4.2899108309298448,0.37036230173694346,null,null,null,null,null,"","",null,null,null,"","",null,null,null,"","",null,null,null,"","",null,null,null,"",""]
[null,"STEP-1：影響円D範囲(d≦D<b）",null,null,null,0.77700000000000014,4.2765228569132887,4.2629556529993895,0.36803517137561415,null,null,null,null,null,"","",null,null,null,"","",null,null,null,"","",null,null,null,"","",null,null,null,"",""]
[null,"STEP-1：影響円D範囲(d≦D<b）",null,null,null,0.86333333333333351,4.2493884490854894,4.2356420152742462,0.36567709398534343,null,null,null,null,null,"","",null,null,null,"","",null,null,null,"","",null,null,null,"","",null,null,null,"",""]
[null,"STEP-1：影響円D範囲(d≦D<b）",null,null,null,0.94966666666666688,4.221895581463003,4.207969917754415,0.3632880695661313,null,null,null,null,null,"","",null,null,null,"","",null,null,null,"","",null,null,null,"","",null,null,null,"",""]
[null,"STEP-1：影響円D範囲(d≦D<b）",null,null,null,1.0360000000000003,4.1940442540458278,4.1799393604398976,0.36086809811797799,null,null,null,null,null,"","",null,null,null,"","",null,null,null,"","",null,null,null,"","",null,null,null,"",""]
[null,"STEP-1：影響円D範囲(d≦D<b）",null,null,null,1.1223333333333336,4.1658344668339664,4.1515503433306922,0.35841717964088327,null,null,null,null,null,"","",null,null,null,"","",null,null,null,"","",null,null,null,"","",null,null,null,"",""]
[null,"STEP-1：影響円D範囲(d≦D<b）",null,null,null,1.208666666666667,4.137266219827417,4.1228028664267988,0.35593531413484714,null,null,null,null,null,"","",null,null,null,"","",null,null,null,"","",null,null,null,"","",null,null,null,"",""]
[null,"STEP-1：影響円D範囲(d≦D<b）",null,null,null,1.2950000000000004,4.1083395130261806,4.0936969297282184,0.35342250159986971,null,null,null,null,null,"","",null,null,null,"","",null,null,null,"","",null,null,null,"","",null,null,null,"",""]
[null,"STEP-1：影響円D範囲(d≦D<b）",null,null,null,1.3813333333333337,4.0790543464302562,4.06423253323495,0.35087874203595087,null,null,null,null,null,"","",null,null,null,"","",null,null,null,"","",null,null,null,"","",null,null,null,"",""]
[null,"STEP-1：影響円D範囲(d≦D<b）",null,null,null,1.4676666666666671,4.0494107200396439,4.0344096769469946,0.34830403544309069,null,null,null,null,null,"","",null,null,null,"","",null,null,null,"","",null,null,null,"","",null,null,null,"",""]
[null,"STEP-1：影響円D範囲(d≦D<b）",null,null,null,1.5540000000000005,4.0194086338543453,4.0042283608643521,0.3456983818212892,null,null,null,null,null,"","",null,null,null,"","",null,null,null,"","",null,null,null,"","",null,null,null,"",""]
[null,"STEP-1：影響円D範囲(d≦D<b）",null,null,null,1.6403333333333339,3.9890480878743588,3.973688584987022,0.34306178117054642,null,null,null,null,null,"","",null,null,null,"","",null,null,null,"","",null,null,null,"","",null,null,null,"",""]
[null,"STEP-1：影響円D範囲(d≦D<b）",null,null,null,1.7266666666666672,3.9583290820996853,3.9427903493150045,0.34039423349086223,null,null,null,null,null,"","",null,null,null,"","",null,null,null,"","",null,null,null,"","",null,null,null,"",""]
[null,"STEP-1：影響円D範囲(d≦D<b）",null,null,null,1.8130000000000006,3.9272516165303237,3.9115336538482994,0.33769573878223669,null,null,null,null,null,"","",null,null,null,"","",null,null,null,"","",null,null,null,"","",null,null,null,"",""]
[null,"STEP-1：影響円D範囲(d≦D<b）",null,null,null,1.899333333333334,3.8958156911662751,3.8799184985869068,0.33496629704466979,null,null,null,null,null,"","",null,null,null,"","",null,null,null,"","",null,null,null,"","",null,null,null,"",""]
[null,"STEP-1：影響円D範囲(d≦D<b）",null,null,null,1.9856666666666674,3.8640213060075386,3.8479448835308268,0.33220590827816066,null,null,null,null,null,"","",null,null,null,"","",null,null,null,"","",null,null,null,"","",null,null,null,"",""]
[null,"STEP-1：影響円D範囲(d≦D<b）",null,null,null,2.0720000000000005,3.8318684610541149,3.8156128086800596,0.32941457248271111,null,null,null,null,null,"","",null,null,null,"","",null,null,null,"","",null,null,null,"","",null,null,null,"",""]
[null,"STEP-1：影響円D範囲(d≦D<b）",null,null,null,2.1583333333333337,3.7993571563060042,3.7829222740346049,0.32659228965832021,null,null,null,null,null,"","",null,null,null,"","",null,null,null,"","",null,null,null,"","",null,null,null,"",""]
[null,"STEP-1：影響円D範囲(d≦D<b）",null,null,null,2.2446666666666668,3.7664873917632056,3.7498732795944627,0.32373905980498791,null,null,null,null,null,"","",null,null,null,"","",null,null,null,"","",null,null,null,"","",null,null,null,"",""]
[null,"STEP-1：影響円D範囲(d≦D<b）",null,null,null,2.331,3.7332591674257198,3.7164658253596334,0.32085488292271436,null,null,null,null,null,"","",null,null,null,"","",null,null,null,"","",null,null,null,"","",null,null,null,"",""]
[null,"STEP-1：影響円D範囲(d≦D<b）",null,null,null,2.4173333333333331,3.6996724832935466,3.6826999113301158,0.31793975901149935,null,null,null,null,null,"","",null,null,null,"","",null,null,null,"","",null,null,null,"","",null,null,null,"",""]
[null,"STEP-1：影響円D範囲(d≦D<b）",null,null,null,2.5036666666666663,3.6657273393666854,3.6485755375059115,0.31499368807134304,null,null,null,null,null,"","",null,null,null,"","",null,null,null,"","",null,null,null,"","",null,null,null,"",""]
[null,"STEP-1：影響円D範囲(d≦D<b）",null,null,null,2.5899999999999994,3.6314237356451375,3.6314237356451375,{"$f":"IFERROR(H79*(F80-F79),\"\")","v":1.6126760973934118E-15},null,null,null,null,null,"","",null,null,null,"","",null,null,null,"","",null,null,null,"","",null,null,null,"",""]
[null,"STEP-1：影響円D範囲(d≦D<b）",null,null,null,2.59,3.6314237356451375,3.6314237356451375,{"$f":"IFERROR(H80*(F81-F80),\"\")","v":0},null,null,null,null,null,"","",null,null,null,"","",null,null,null,"","",null,null,null,"","",null,null,null,"",""]
[null,null,null,null,null,2.59,null,"",""]
[null,null,null,null,null,null,null,"",""]
[null,null,null,null,null,null,null,"",""]
[null,null,null,null,null,null,null,"",""]
[null,null,null,null,null,null,null,"",""]
[null,null,null,null,null,null,null,"",""]
[null,null,null,null,null,null,null,"",""]
[null,null,null,null,null,null,null,"",""]
[null,null,null,null,null,null,null,"",""]
[null,null,null,null,null,null,null,"",""]
[null,null,null,null,null,null,null,"",""]
[null,null,null,null,null,null,null,"",""]
[null,null,null,null,null,null,null,"",""]
[null,null,null,null,null,null,null,"","",null,null,null,null,null,"","",null,null,null,{"$f":"IFERROR(AVERAGE(S94:S95),\"\")","v":""},{"$f":"IFERROR(T94*(R95-R94),\"\")","v":""},null,null,null,{"$f":"IFERROR(AVERAGE(X94:X95),\"\")","v":""},{"$f":"IFERROR(Y94*(W95-W94),\"\")","v":""},null,null,null,{"$f":"IFERROR(AVERAGE(AC94:AC95),\"\")","v":""},{"$f":"IFERROR(AD94*(AB95-AB94),\"\")","v":""},null,null,null,{"$f":"IFERROR(AVERAGE(AH94:AH95),\"\")","v":""},{"$f":"IFERROR(AI94*(AG95-AG94),\"\")","v":""}]
[null,null,null,null,null,null,null,"","",null,null,null,null,null,"","",null,null,null,"","",null,null,null,"","",null,null,null,"","",null,null,null,"",""]
[null,null,null,null,null,null,null,"","",null,null,null,null,null,"","",null,null,null,"","",null,null,null,"","",null,null,null,"","",null,null,null,"",""]
[null,null,null,null,null,null,null,"","",null,null,null,null,null,"","",null,null,null,"","",null,null,null,"","",null,null,null,"","",null,null,null,"",""]
[null,null,null,null,null,null,null,"","",null,null,null,null,null,"","",null,null,null,"","",null,null,null,"","",null,null,null,"","",null,null,null,"",""]
[null,null,null,null,null,null,null,"","",null,null,null,null,null,"","",null,null,null,"","",null,null,null,"","",null,null,null,"","",null,null,null,"",""]
[null,null,null,null,null,null,null,"","",null,null,null,null,null,"","",null,null,null,"","",null,null,null,"","",null,null,null,"","",null,null,null,"",""]
[null,null,null,null,null,null,null,"","",null,null,null,null,null,"","",null,null,null,"","",null,null,null,"","",null,null,null,"","",null,null,null,"",""]
[null,null,null,null,null,null,null,"","",null,null,null,null,null,"","",null,null,null,"","",null,null,null,"","",null,null,null,"","",null,null,null,"",""]
[null,null,null,null,null,null,null,"","",null,null,null,null,null,"","",null,null,null,"","",null,null,null,"","",null,null,null,"","",null,null,null,"",""]
[null,null,null,null,null,null,null,"","",null,null,null,null,null,"","",null,null,null,"","",null,null,null,"","",null,null,null,"","",null,null,null,"",""]
[null,null,null,null,null,null,null,"","",null,null,null,null,null,"","",null,null,null,"","",null,null,null,"","",null,null,null,"","",null,null,null,"",""]
[null,null,null,null,null,null,null,"","",null,null,null,null,null,"","",null,null,null,"","",null,null,null,"","",null,null,null,"","",null,null,null,"",""]
[null,null,null,null,null,null,null,"","",null,null,null,null,null,"","",null,null,null,"","",null,null,null,"","",null,null,null,"","",null,null,null,"",""]
[null,null,null,null,null,null,null,"","",null,null,null,null,null,"","",null,null,null,"","",null,null,null,"","",null,null,null,"","",null,null,null,"",""]
[null,null,null,null,null,null,null,"","",null,null,null,null,null,"","",null,null,null,"","",null,null,null,"","",null,null,null,"","",null,null,null,"",""]
[null,null,null,null,null,null,null,"","",null,null,null,null,null,"","",null,null,null,"","",null,null,null,"","",null,null,null,"","",null,null,null,"",""]
[null,null,null,null,null,null,null,"","",null,null,null,null,null,"","",null,null,null,"","",null,null,null,"","",null,null,null,"","",null,null,null,"",""]
[null,null,null,null,null,null,null,"","",null,null,null,null,null,"","",null,null,null,"","",null,null,null,"","",null,null,null,"","",null,null,null,"",""]
[null,null,null,null,null,null,null,"","",null,null,null,null,null,"","",null,null,null,"","",null,null,null,"","",null,null,null,"","",null,null,null,"",""]
[null,null,null,null,null,null,null,{"$f":"IFERROR(AVERAGE(G114:G115),\"\")","v":""},"",null,null,null,null,null,{"$f":"IFERROR(AVERAGE(N114:N115),\"\")","v":""},{"$f":"IFERROR(O114*(M115-M114),\"\")","v":""},null,null,null,"","",null,null,null,"","",null,null,null,"","",null,null,null,"",""]
[null,null,null,null,null,null,null,"","",null,null,null,null,null,"","",null,null,null,"","",null,null,null,"","",null,null,null,"","",null,null,null,"",""]
[null,null,null,null,null,null,null,"","",null,null,null,null,null,"","",null,null,null,"","",null,null,null,"","",null,null,null,"","",null,null,null,"",""]
[null,null,null,null,null,null,null,"","",null,null,null,null,null,"","",null,null,null,"","",null,null,null,"","",null,null,null,"","",null,null,null,"",""]
[null,null,null,null,null,null,null,"","",null,null,null,null,null,"","",null,null,null,"","",null,null,null,"","",null,null,null,"","",null,null,null,"",""]
[null,null,null,null,null,null,null,"","",null,null,null,null,null,"","",null,null,null,"","",null,null,null,"","",null,null,null,"","",null,null,null,"",""]
[null,null,null,null,null,null,null,"","",null,null,null,null,null,"","",null,null,null,"","",null,null,null,"","",null,null,null,"","",null,null,null,"",""]
[null,null,null,null,null,null,null,"","",null,null,null,null,null,"","",null,null,null,"","",null,null,null,"","",null,null,null,"","",null,null,null,"",""]
[null,null,null,null,null,null,null,"","",null,null,null,null,null,"","",null,null,null,"","",null,null,null,"","",null,null,null,"","",null,null,null,"",""]
[null,null,null,null,null,null,null,"","",null,null,null,null,null,"","",null,null,null,"","",null,null,null,"","",null,null,null,"","",null,null,null,"",""]
[null,null,null,null,null,null,null,"","",null,null,null,null,null,"","",null,null,null,"","",null,null,null,"","",null,null,null,"","",null,null,null,"",""]
[null,null,null,null,null,null,null,"","",null,null,null,null,null,"","",null,null,null,"","",null,null,null,"","",null,null,null,"","",null,null,null,"",""]
[null,null,null,null,null,null,null,"","",null,null,null,null,null,"","",null,null,null,"","",null,null,null,"","",null,null,null,"","",null,null,null,"",""]
[null,null,null,null,null,null,null,"","",null,null,null,null,null,"","",null,null,null,"","",null,null,null,"","",null,null,null,"","",null,null,null,"",""]
[null,null,null,null,null,null,null,"","",null,null,null,null,null,"","",null,null,null,"","",null,null,null,"","",null,null,null,"","",null,null,null,"",""]
[null,null,null,null,null,null,null,"","",null,null,null,null,null,"","",null,null,null,"","",null,null,null,"","",null,null,null,"","",null,null,null,"",""]
[null,null,null,null,null,null,null,"","",null,null,null,null,null,"","",null,null,null,"","",null,null,null,"","",null,null,null,"","",null,null,null,"",""]
[null,null,null,null,null,null,null,"","",null,null,null,null,null,"","",null,null,null,"","",null,null,null,"","",null,null,null,"","",null,null,null,"",""]
[null,null,null,null,null,null,null,"","",null,null,null,null,null,"","",null,null,null,"","",null,null,null,"","",null,null,null,"","",null,null,null,"",""]
[null,null,null,null,null,null,null,"","",null,null,null,null,null,"","",null,null,null,"","",null,null,null,"","",null,null,null,"","",null,null,null,"",""]
[null,null,null,null,null,null,null,"","",null,null,null,null,null,"","",null,null,null,"","",null,null,null,"","",null,null,null,"","",null,null,null,"",""]
[null,null,null,null,null,null,null,"","",null,null,null,null,null,"","",null,null,null,"","",null,null,null,"","",null,null,null,"","",null,null,null,"",""]
[null,null,null,null,null,null,null,"","",null,null,null,null,null,"","",null,null,null,"","",null,null,null,"","",null,null,null,"","",null,null,null,"",""]
[null,null,null,null,null,null,null,"","",null,null,null,null,null,"","",null,null,null,"","",null,null,null,"","",null,null,null,"","",null,null,null,"",""]
[null,null,null,null,null,null,null,"","",null,null,null,null,null,"","",null,null,null,"","",null,null,null,"","",null,null,null,"","",null,null,null,"",""]
[null,null,null,null,null,null,null,"","",null,null,null,null,null,"","",null,null,null,"","",null,null,null,"","",null,null,null,"","",null,null,null,"",""]
[null,null,null,null,null,null,null,"","",null,null,null,null,null,"","",null,null,null,"","",null,null,null,"","",null,null,null,"","",null,null,null,"",""]
[null,null,null,null,null,null,null,"","",null,null,null,null,null,"","",null,null,null,"","",null,null,null,"","",null,null,null,"","",null,null,null,"",""]
[null,null,null,null,null,null,null,"","",null,null,null,null,null,"","",null,null,null,"","",null,null,null,"","",null,null,null,"","",null,null,null,"",""]
[null,null,null,null,null,null,null,"","",null,null,null,null,null,"","",null,null,null,"","",null,null,null,"","",null,null,null,"","",null,null,null,"",""]
[null,null,null,null,null,null,null,"",{"$f":"IFERROR(H144*(F145-F144),\"\")","v":""},null,null,null,null,null,"","",null,null,null,"","",null,null,null,"","",null,null,null,"","",null,null,null,"",""]
[null,null,null,null,null,null,null,"","",null,null,null,null,null,"","",null,null,null,"","",null,null,null,"","",null,null,null,"","",null,null,null,"",""]
[null,null,null,null,null,null,null,"","",null,null,null,null,null,{"$f":"IFERROR(AVERAGE(N146:N147),\"\")","v":""},{"$f":"IFERROR(O146*(M147-M146),\"\")","v":""},null,null,null,"","",null,null,null,"","",null,null,null,"","",null,null,null,"",""]
[null,null,null,null,null,null,null,"","",null,null,null,null,null,"","",null,null,null,"","",null,null,null,"","",null,null,null,"","",null,null,null,"",""]
[null,null,null,null,null,null,null,"","",null,null,null,null,null,"","",null,null,null,"","",null,null,null,"","",null,null,null,"","",null,null,null,"",""]
[null,null,null,null,null,null,null,"","",null,null,null,null,null,"","",null,null,null,"","",null,null,null,"","",null,null,null,"","",null,null,null,"",""]
[null,null,null,null,null,null,null,"","",null,null,null,null,null,"","",null,null,null,"","",null,null,null,"","",null,null,null,"","",null,null,null,"",""]
[null,null,null,null,null,null,null,"","",null,null,null,null,null,"","",null,null,null,"","",null,null,null,"","",null,null,null,"","",null,null,null,"",""]
[null,null,null,null,null,null,null,"","",null,null,null,null,null,"","",null,null,null,"","",null,null,null,"","",null,null,null,"","",null,null,null,"",""]
[null,null,null,null,null,null,null,"","",null,null,null,null,null,"","",null,null,null,"","",null,null,null,"","",null,null,null,"","",null,null,null,"",""]
[null,null,null,null,null,null,null,"","",null,null,null,null,null,"","",null,null,null,"","",null,null,null,"","",null,null,null,"","",null,null,null,"",""]
[null,null,null,null,null,null,null,"","",null,null,null,null,null,"","",null,null,null,"","",null,null,null,"","",null,null,null,"","",null,null,null,"",""]
[null,null,null,null,null,null,null,"","",null,null,null,null,null,"","",null,null,null,"","",null,null,null,"","",null,null,null,"","",null,null,null,"",""]
[null,null,null,null,null,null,null,"","",null,null,null,null,null,"","",null,null,null,"","",null,null,null,"","",null,null,null,"","",null,null,null,"",""]
[null,null,null,null,null,null,null,"","",null,null,null,null,null,"","",null,null,null,{"$f":"IFERROR(AVERAGE(S158:S159),\"\")","v":""},{"$f":"IFERROR(T158*(R159-R158),\"\")","v":""},null,null,null,{"$f":"IFERROR(AVERAGE(X158:X159),\"\")","v":""},{"$f":"IFERROR(Y158*(W159-W158),\"\")","v":""},null,null,null,{"$f":"IFERROR(AVERAGE(AC158:AC159),\"\")","v":""},{"$f":"IFERROR(AD158*(AB159-AB158),\"\")","v":""},null,null,null,{"$f":"IFERROR(AVERAGE(AH158:AH159),\"\")","v":""},{"$f":"IFERROR(AI158*(AG159-AG158),\"\")","v":""}]
[null,null,null,null,null,null,null,"","",null,null,null,null,null,"","",null,null,null,"","",null,null,null,"","",null,null,null,"","",null,null,null,"",""]
[null,null,null,null,null,null,null,"","",null,null,null,null,null,"","",null,null,null,"","",null,null,null,"","",null,null,null,"","",null,null,null,"",""]
[null,null,null,null,null,null,null,"","",null,null,null,null,null,"","",null,null,null,"","",null,null,null,"","",null,null,null,"","",null,null,null,"",""]
[null,null,null,null,null,null,null,"","",null,null,null,null,null,"","",null,null,null,"","",null,null,null,"","",null,null,null,"","",null,null,null,"",""]
[null,null,null,null,null,null,null,"","",null,null,null,null,null,"","",null,null,null,"","",null,null,null,"","",null,null,null,"","",null,null,null,"",""]
[null,null,null,null,null,null,null,"","",null,null,null,null,null,"","",null,null,null,"","",null,null,null,"","",null,null,null,"","",null,null,null,"",""]
[null,null,null,null,null,null,null,"","",null,null,null,null,null,"","",null,null,null,"","",null,null,null,"","",null,null,null,"","",null,null,null,"",""]
[null,null,null,null,null,null,null,"","",null,null,null,null,null,"","",null,null,null,"","",null,null,null,"","",null,null,null,"","",null,null,null,"",""]
[null,null,null,null,null,null,null,"","",null,null,null,null,null,"","",null,null,null,"","",null,null,null,"","",null,null,null,"","",null,null,null,"",""]
[null,null,null,null,null,null,null,"","",null,null,null,null,null,"","",null,null,null,"","",null,null,null,"","",null,null,null,"","",null,null,null,"",""]
[null,null,null,null,null,null,null,"","",null,null,null,null,null,"","",null,null,null,"","",null,null,null,"","",null,null,null,"","",null,null,null,"",""]
[null,null,null,null,null,null,null,"","",null,null,null,null,null,"","",null,null,null,"","",null,null,null,"","",null,null,null,"","",null,null,null,"",""]
[null,null,null,null,null,null,null,"","",null,null,null,null,null,"","",null,null,null,"","",null,null,null,"","",null,null,null,"","",null,null,null,"",""]
[null,null,null,null,null,null,null,"","",null,null,null,null,null,{"$f":"IFERROR(AVERAGE(K172:K173),\"\")","v":""},{"$f":"IFERROR(O172*(J173-M172),\"\")","v":""},null,null,null,{"$f":"IFERROR(AVERAGE(P172:P173),\"\")","v":""},{"$f":"IFERROR(T172*(O173-R172),\"\")","v":""},null,null,null,{"$f":"IFERROR(AVERAGE(U172:U173),\"\")","v":""},{"$f":"IFERROR(Y172*(T173-W172),\"\")","v":""},null,null,null,{"$f":"IFERROR(AVERAGE(Z172:Z173),\"\")","v":""},{"$f":"IFERROR(AD172*(Y173-AB172),\"\")","v":""},null,null,null,{"$f":"IFERROR(AVERAGE(AE172:AE173),\"\")","v":""},{"$f":"IFERROR(AI172*(AD173-AG172),\"\")","v":""}]
[null,null,null,null,null,null,null,"",""]
[null,null,null,null,null,null,null,"",""]
[null,null,null,null,null,null,null,"",""]
[null,null,null,null,null,null,null,"",""]
[null,null,null,null,null,null,null,"",""]
[null,null,null,null,null,null,null,{"$f":"IFERROR(AVERAGE(G178:G179),\"\")","v":""},""]
[null,null,null,null,null,null,null,"",""]
[null,null,null,null,null,null,null,"",""]
[null,null,null,null,null,null,null,"",""]
[null,null,null,null,null,null,null,"",""]
[null,null,null,null,null,null,null,"",""]
[null,null,null,null,null,null,null,"",""]
[null,null,null,null,null,null,null,"",""]
[null,null,null,null,null,null,null,"",""]
[null,null,null,null,null,null,null,"",""]
[null,null,null,null,null,null,null,"",""]
[null,null,null,null,null,null,null,"",""]
[null,null,null,null,null,null,null,"",""]
[null,null,null,null,null,null,null,"",""]
[null,null,null,null,null,null,null,"",""]
[null,null,null,null,null,null,null,"",""]
[null,null,null,null,null,null,null,"",""]
[null,null,null,null,null,null,null,"",""]
[null,null,null,null,null,null,null,"",""]
[null,null,null,null,null,null,null,"",""]
[null,null,null,null,null,null,null,"",""]
[null,null,null,null,null,null,null,"",""]
[null,null,null,null,null,null,null,"",""]
[null,null,null,null,null,null,null,"",""]
[null,null,null,null,null,null,null,"",""]
[null,null,null,null,null,null,null,"",""]
[null,null,null,null,null,null,null,"",""]
[null,null,null,null,null,null,null,"",""]
[null,null,null,null,null,null,null,"",""]
[null,null,null,null,null,null,null,"",""]
[null,null,null,null,null,null,null,"",{"$f":"IFERROR(H208*(F209-F208),\"\")","v":""}]
[null,null,null,null,null,null,null,"",""]
[null,null,null,null,null,null,null,"",""]
[null,null,null,null,null,null,null,"",""]
[null,null,null,null,null,null,null,"",""]
[null,null,null,null,null,null,null,"",""]
[null,null,null,null,null,null,null,"",""]
[null,null,null,null,null,null,null,"",""]
[null,null,null,null,null,null,null,"",""]
[null,null,null,null,null,null,null,"",""]
[null,null,null,null,null,null,null,"",""]
[null,null,null,null,null,null,null,"",""]
[null,null,null,null,null,null,null,"",""]
[null,null,null,null,null,null,null,"",""]
[null,null,null,null,null,null,null,"",""]
[null,null,null,null,null,null,null,"",""]
[null,null,null,null,null,null,null,"",""]
[null,null,null,null,null,null,null,"",""]
[null,null,null,null,null,null,null,"",""]
[null,null,null,null,null,null,null,"",""]
[null,null,null,null,null,null,null,"",""]
[null,null,null,null,null,null,null,"",""]
[null,null,null,null,null,null,null,"",""]
[null,null,null,null,null,null,null,"",""]
[null,null,null,null,null,null,null,"",""]
[null,null,null,null,null,null,null,"",""]
[null,null,null,null,null,null,null,"",""]
[null,null,null,null,null,null,null,"",""]
[null,null,null,null,null,null,null,"",""]
[null,null,null,null,null,null,null,"",""]
[null,null,null,null,null,null,null,"",""]
[null,null,null,null,null,null,null,"",""]
[null,null,null,null,null,null,null,{"$f":"IFERROR(AVERAGE(G240:G241),\"\")","v":""},{"$f":"IFERROR(H240*(F241-F240),\"\")","v":""}]
[null,null,null,null,null,null,null,"",""]
[null,null,null,null,null,null,null,"",""]
[null,null,null,null,null,null,null,"",""]
[null,null,null,null,null,null,null,"",""]
[null,null,null,null,null,null,null,"",""]
[null,null,null,null,null,null,null,"",""]
[null,null,null,null,null,null,null,"",""]
[null,null,null,null,null,null,null,"",""]
[null,null,null,null,null,null,null,"",""]
[null,null,null,null,null,null,null,"",""]
[null,null,null,null,null,null,null,"",""]
[null,null,null,null,null,null,null,"",""]
[null,null,null,null,null,null,null,"",""]
[null,null,null,null,null,null,null,"",""]
[null,null,null,null,null,null,null,"",""]
[null,null,null,null,null,null,null,"",""]
[null,null,null,null,null,null,null,"",""]
[null,null,null,null,null,null,null,"",""]
[null,null,null,null,null,null,null,"",""]
[null,null,null,null,null,null,null,"",""]
[null,null,null,null,null,null,null,"",""]
[null,null,null,null,null,null,null,"",""]
[null,null,null,null,null,null,null,"",""]
[null,null,null,null,null,null,null,"",""]
[null,null,null,null,null,null,null,"",""]
[null,null,null,null,null,null,null,"",""]
[null,null,null,null,null,null,null,"",""]
[null,null,null,null,null,null,null,"",""]
[null,null,null,null,null,null,null,"",""]
[null,null,null,null,null,null,null,"",""]
[null,null,null,null,null,null,null,"",""]
[null,null,null,null,null,null,null,"",""]
[null,null,null,null,null,null,null,"",""]
[null,null,null,null,null,null,null,"",""]
[null,null,null,null,null,null,null,"",""]
[null,null,null,null,null,null,null,"",""]
[null,null,null,null,null,null,null,"",""]
[null,null,null,null,null,null,null,"",""]
[null,null,null,null,null,null,null,"",""]
[null,null,null,null,null,null,null,"",""]
[null,null,null,null,null,null,null,"",""]
[null,null,null,null,null,null,null,"",""]
[null,null,null,null,null,null,null,"",""]
[null,null,null,null,null,null,null,"",""]
[null,null,null,null,null,null,null,"",""]
[null,null,null,null,null,null,null,"",""]
[null,null,null,null,null,null,null,"",""]
[null,null,null,null,null,null,null,"",""]
[null,null,null,null,null,null,null,"",""]
[null,null,null,null,null,null,null,"",""]
[null,null,null,null,null,null,null,"",""]
[null,null,null,null,null,null,null,"",""]
[null,null,null,null,null,null,null,"",""]
[null,null,null,null,null,null,null,"",""]
[null,null,null,null,null,null,null,"",""]
[null,null,null,null,null,null,null,"",""]
[null,null,null,null,null,null,null,"",""]
[null,null,null,null,null,null,null,"",""]
[null,null,null,null,null,null,null,"",""]
[null,null,null,null,null,null,null,"",""]
[null,null,null,null,null,null,null,"",""]
[null,null,null,null,null,null,null,"",""]
[null,null,null,null,null,null,null,"",""]
[null,null,null,null,null,null,null,{"$f":"IFERROR(AVERAGE(G304:G305),\"\")","v":""},{"$f":"IFERROR(H304*(F305-F304),\"\")","v":""}]
[null,null,null,null,null,null,null,"",""]
[null,null,null,null,null,null,null,"",""]
[null,null,null,null,null,null,null,"",""]
[null,null,null,null,null,null,null,"",""]
[null,null,null,null,null,null,null,"",""]
[null,null,null,null,null,null,null,"",""]
[null,null,null,null,null,null,null,"",""]
[null,null,null,null,null,null,null,"",""]
[null,null,null,null,null,null,null,"",""]
[null,null,null,null,null,null,null,"",""]
[null,null,null,null,null,null,null,"",""]
[null,null,null,null,null,null,null,"",""]
[null,null,null,null,null,null,null,"",""]
[null,null,null,null,null,null,null,"",""]
[null,null,null,null,null,null,null,"",""]
[null,null,null,null,null,null,null,"",""]
[null,null,null,null,null,null,null,"",""]
[null,null,null,null,null,null,null,"",""]
[null,null,null,null,null,null,null,"",""]
[null,null,null,null,null,null,null,"",""]
[null,null,null,null,null,null,null,"",""]
[null,null,null,null,null,null,null,"",""]
[null,null,null,null,null,null,null,"",""]
[null,null,null,null,null,null,null,"",""]
[null,null,null,null,null,null,null,"",""]
[null,null,null,null,null,null,null,"",""]
[null,null,null,null,null,null,null,"",""]
[null,null,null,null,null,null,null,"",""]
[null,null,null,null,null,null,null,"",""]
[null,null,null,null,null,null,null,"",""]
[null,null,null,null,null,null,null,"",""]
[null,null,null,null,null,null,null,"",""]
[null,null,null,null,null,null,null,"",""]
[null,null,null,null,null,null,null,"",""]
[null,null,null,null,null,null,null,"",""]
[null,null,null,null,null,null,null,"",""]
[null,null,null,null,null,null,null,"",""]
[null,null,null,null,null,null,null,"",""]
[null,null,null,null,null,null,null,"",""]
[null,null,null,null,null,null,null,"",""]
[null,null,null,null,null,null,null,"",""]
[null,null,null,null,null,null,null,"",""]
[null,null,null,null,null,null,null,"",""]
[null,null,null,null,null,null,null,"",""]
[null,null,null,null,null,null,null,"",""]
[null,null,null,null,null,null,null,"",""]
[null,null,null,null,null,null,null,"",""]
[null,null,null,null,null,null,null,"",""]
[null,null,null,null,null,null,null,"",""]
[null,null,null,null,null,null,null,"",""]
[null,null,null,null,null,null,null,"",""]
[null,null,null,null,null,null,null,"",""]
[null,null,null,null,null,null,null,"",""]
[null,null,null,null,null,null,null,"",""]
[null,null,null,null,null,null,null,"",""]
[null,null,null,null,null,null,null,"",""]
[null,null,null,null,null,null,null,"",""]
[null,null,null,null,null,null,null,"",""]
[null,null,null,null,null,null,null,"",""]
[null,null,null,null,null,null,null,"",""]
[null,null,null,null,null,null,null,"",""]
[null,null,null,null,null,null,null,"",""]
[null,null,null,null,null,null,null,"",""]
[null,null,null,null,null,null,null,{"$f":"IFERROR(AVERAGE(G368:G369),\"\")","v":""},{"$f":"IFERROR(H368*(F369-F368),\"\")","v":""}]
[null,null,null,null,null,null,null,"",""]
[null,null,null,null,null,null,null,"",""]
[null,null,null,null,null,null,null,"",""]
[null,null,null,null,null,null,null,"",""]
[null,null,null,null,null,null,null,"",""]
[null,null,null,null,null,null,null,"",""]
[null,null,null,null,null,null,null,"",""]
[null,null,null,null,null,null,null,"",""]
[null,null,null,null,null,null,null,"",""]
[null,null,null,null,null,null,null,"",""]
[null,null,null,null,null,null,null,"",""]
[null,null,null,null,null,null,null,"",""]
[null,null,null,null,null,null,null,"",""]
[null,null,null,null,null,null,null,"",""]
[null,null,null,null,null,null,null,"",""]
[null,null,null,null,null,null,null,"",""]
[null,null,null,null,null,null,null,"",""]
[null,null,null,null,null,null,null,"",""]
[null,null,null,null,null,null,null,"",""]
[null,null,null,null,null,null,null,"",""]
[null,null,null,null,null,null,null,"",""]
[null,null,null,null,null,null,null,"",""]
[null,null,null,null,null,null,null,"",""]
[null,null,null,null,null,null,null,"",""]
[null,null,null,null,null,null,null,"",""]
[null,null,null,null,null,null,null,"",""]
[null,null,null,null,null,null,null,"",""]
[null,null,null,null,null,null,null,"",""]
[null,null,null,null,null,null,null,"",""]
[null,null,null,null,null,null,null,"",""]
[null,null,null,null,null,null,null,"",""]
[null,null,null,null,null,null,null,"",""]
[null,null,null,null,null,null,null,"",""]
[null,null,null,null,null,null,null,"",""]
[null,null,null,null,null,null,null,"",""]
[null,null,null,null,null,null,null,"",""]
[null,null,null,null,null,null,null,"",""]
[null,null,null,null,null,null,null,"",""]
[null,null,null,null,null,null,null,"",""]
[null,null,null,null,null,null,null,"",""]
[null,null,null,null,null,null,null,"",""]
[null,null,null,null,null,null,null,"",""]
[null,null,null,null,null,null,null,"",""]
[null,null,null,null,null,null,null,"",""]
[null,null,null,null,null,null,null,"",""]
[null,null,null,null,null,null,null,"",""]
[null,null,null,null,null,null,null,"",""]
[null,null,null,null,null,null,null,"",""]
[null,null,null,null,null,null,null,"",""]
[null,null,null,null,null,null,null,"",""]
[null,null,null,null,null,null,null,"",""]
[null,null,null,null,null,null,null,"",""]
[null,null,null,null,null,null,null,"",""]
[null,null,null,null,null,null,null,"",""]
[null,null,null,null,null,null,null,"",""]
[null,null,null,null,null,null,null,"",""]
[null,null,null,null,null,null,null,"",""]
[null,null,null,null,null,null,null,"",""]
[null,null,null,null,null,null,null,"",""]
[null,null,null,null,null,null,null,"",""]
[null,null,null,null,null,null,null,"",""]
[null,null,null,null,null,null,null,"",""]
[null,null,null,null,null,null,null,"",""]
[null,null,null,null,null,null,null,{"$f":"IFERROR(AVERAGE(G432:G433),\"\")","v":""},{"$f":"IFERROR(H432*(F433-F432),\"\")","v":""}]
[null,null,null,null,null,null,null,"",""]
[null,null,null,null,null,null,null,"",""]
[null,null,null,null,null,null,null,"",""]
[null,null,null,null,null,null,null,"",""]
[null,null,null,null,null,null,null,"",""]
[null,null,null,null,null,null,null,"",""]
[null,null,null,null,null,null,null,"",""]
[null,null,null,null,null,null,null,"",""]
[null,null,null,null,null,null,null,"",""]
[null,null,null,null,null,null,null,"",""]
[null,null,null,null,null,null,null,"",""]
[null,null,null,null,null,null,null,"",""]
[null,null,null,null,null,null,null,"",""]
[null,null,null,null,null,null,null,"",""]
[null,null,null,null,null,null,null,"",""]
[null,null,null,null,null,null,null,"",""]
[null,null,null,null,null,null,null,"",""]
[null,null,null,null,null,null,null,"",""]
[null,null,null,null,null,null,null,"",""]
[null,null,null,null,null,null,null,"",""]
[null,null,null,null,null,null,null,"",""]
[null,null,null,null,null,null,null,"",""]
[null,null,null,null,null,null,null,"",""]
[null,null,null,null,null,null,null,"",""]
[null,null,null,null,null,null,null,"",""]
[null,null,null,null,null,null,null,"",""]
[null,null,null,null,null,null,null,"",""]
[null,null,null,null,null,null,null,"",""]
[null,null,null,null,null,null,null,"",""]
[null,null,null,null,null,null,null,"",""]
[null,null,null,null,null,null,null,"",""]
[null,null,null,null,null,null,null,"",""]
[null,null,null,null,null,null,null,"",""]
[null,null,null,null,null,null,null,"",""]
[null,null,null,null,null,null,null,"",""]
[null,null,null,null,null,null,null,"",""]
[null,null,null,null,null,null,null,"",""]
[null,null,null,null,null,null,null,"",""]
[null,null,null,null,null,null,null,"",""]
[null,null,null,null,null,null,null,"",""]
[null,null,null,null,null,null,null,"",""]
[null,null,null,null,null,null,null,"",""]
[null,null,null,null,null,null,null,"",""]
[null,null,null,null,null,null,null,"",""]
[null,null,null,null,null,null,null,"",""]
[null,null,null,null,null,null,null,"",""]
[null,null,null,null,null,null,null,"",""]
[null,null,null,null,null,null,null,"",""]
[null,null,null,null,null,null,null,"",""]
[null,null,null,null,null,null,null,"",""]
[null,null,null,null,null,null,null,"",""]
[null,null,null,null,null,null,null,"",""]
[null,null,null,null,null,null,null,"",""]
[null,null,null,null,null,null,null,"",""]
[null,null,null,null,null,null,null,"",""]
[null,null,null,null,null,null,null,"",""]
[null,null,null,null,null,null,null,"",""]
[null,null,null,null,null,null,null,"",""]
[null,null,null,null,null,null,null,"",""]
[null,null,null,null,null,null,null,"",""]
[null,null,null,null,null,null,null,"",""]
[null,null,null,null,null,null,null,"",""]
[null,null,null,null,null,null,null,"",""]
[null,null,null,null,null,null,null,{"$f":"IFERROR(AVERAGE(G496:G497),\"\")","v":""},{"$f":"IFERROR(H496*(F497-F496),\"\")","v":""}]
[null,null,null,null,null,null,null,"",""]
[null,null,null,null,null,null,null,"",""]
[null,null,null,null,null,null,null,"",""]
[null,null,null,null,null,null,null,"",""]
[null,null,null,null,null,null,null,"",""]
[null,null,null,null,null,null,null,"",""]
[null,null,null,null,null,null,null,"",""]
[null,null,null,null,null,null,null,"",""]
[null,null,null,null,null,null,null,"",""]
[null,null,null,null,null,null,null,"",""]
[null,null,null,null,null,null,null,"",""]
[null,null,null,null,null,null,null,"",""]
[null,null,null,null,null,null,null,"",""]
[null,null,null,null,null,null,null,"",""]
[null,null,null,null,null,null,null,"",""]
[null,null,null,null,null,null,null,"",""]
[null,null,null,null,null,null,null,"",""]
[null,null,null,null,null,null,null,"",""]
[null,null,null,null,null,null,null,"",""]
[null,null,null,null,null,null,null,"",""]
[null,null,null,null,null,null,null,{"$f":"IFERROR(AVERAGE(G517:G518),\"\")","v":""},{"$f":"IFERROR(H517*(F518-F517),\"\")","v":""}]
[null,null,null,null,null,null,null,"",""]
[null,null,null,null,null,null,null,"",""]
[null,null,null,null,null,null,null,"",""]
[null,null,null,null,null,null,null,"",""]
[null,null,null,null,null,null,null,"",""]
[null,null,null,null,null,null,null,"",""]
[null,null,null,null,null,null,null,"",""]
[null,null,null,null,null,null,null,"",""]
[null,null,null,null,null,null,null,"",""]
[null,null,null,null,null,null,null,"",""]
[null,null,null,null,null,null,null,"",""]
[null,null,null,null,null,null,null,"",""]

{"sheet":"単軸三角形配置","index":3,"n_rows":216,"n_cols":64,"rows_kept":216,"cut":false,"hidden":false,"merged":[[15,6,15,9],[7,2,7,3],[12,1,13,1],[12,4,13,4],[12,5,13,5],[12,6,13,6],[11,2,11,3],[9,2,9,3],[10,2,10,3],[2,1,7,1],[4,7,4,9],[5,7,5,9],[1,1,1,3],[2,2,2,3],[3,2,4,3],[2,7,2,9],[3,7,3,9]]}
["盛土体積 計算条件",null,null,null,null,null,null,null,null,null,null,"☆","⇦検討条件参照先"]
[null,"項　　　目",null,null,"記号","値","単位","備考",null,null,null,null,null,null,null,null,null,"ー積分計算に使用する部分ー"]
[null,"セメント\nコラム\n改良体","改良体直径",null,"ｄ",{"$f":"INDIRECT(\"'\"&$L$1&\"'!\"&L3)","v":1},"m",null,null,null,null,"F4","改良体直径はd＝0.6～1.3m",null,null,null,null,null,null,{"$f":"VLOOKUP(\"〇\",U12:W14,3,FALSE)","v":3}]
[null,null,"改良体間隔\n (改良体中心間隔)",null,"a",{"$f":"INDIRECT(\"'\"&$L$1&\"'!\"&L4)","v":2.2999999999999998},"〃",null,null,null,null,"F5","改良体間隔はλ＝1.0～2.5m",null,null,null,null,"影響円直径D","その時の高さ","面積","面積計算STEP",null,null,null,"影響円の範囲"]
[null,null,null,null,"b",{"$f":"INDIRECT(\"'\"&$L$1&\"'!\"&L5)","v":2.2999999999999998},"〃",null,null,null,null,"F6","改良率はap＝10%以上",null,null,null,null,null,null,{"$f":"T18","v":2.2523009183012754},{"$f":"U18","v":"STEP-0：底面積（d=D）"}]
[null,null,null,null,null,null,null,null,null,null,null,"F7",null,null,null,null,1,{"$f":"SMALL($M$18:$M$22,Q6)","v":1},{"$f":"SMALL($N$18:$N$22,Q6)","v":0},{"$f":"VLOOKUP(R7,$M$19:$R$21,T3,FALSE)","v":1.815711867822569},{"$f":"X6&Y6&Z6&AA6&\"）\"","v":"STEP-1：影響円D範囲(d≦D<a）"},null,null,"STEP-1：影響円D範囲(",{"$f":"R18","v":"d"},"≦D<",{"$f":"VLOOKUP(R7,$M$19:$R$22,6,FALSE)","v":"a"}]
[null,null,null,null,null,null,null,null,null,null,null,"F8",null,null,null,null,2,{"$f":"SMALL($M$18:$M$22,Q7)","v":2.2999999999999998},{"$f":"SMALL($N$18:$N$22,Q7)","v":7.4295339967948753},{"$f":"VLOOKUP(R8,$M$19:$R$21,T3,FALSE)","v":{"$error":"#NUM!"}},{"$f":"X7&Y7&Z7&AA7&\"）\"","v":"STEP-2：影響円D範囲(a≦D<c）"},null,null,"STEP-2：影響円D範囲(",{"$f":"AA6","v":"a"},"≦D<",{"$f":"VLOOKUP(R8,$M$19:$R$22,6,FALSE)","v":"c"}]
[null,null,"改良率",null,"ａp",{"$f":"ROUNDDOWN(T26,3)","v":0.14799999999999999},"-",null,null,null,null,"F13","盛土高",null,null,null,3,{"$f":"SMALL($M$18:$M$22,Q8)","v":2.5714781741247581},{"$f":"SMALL($N$18:$N$22,Q8)","v":8.9810388614469456},{"$f":"VLOOKUP(R9,$M$19:$R$21,T3,FALSE)","v":{"$error":"#NUM!"}},{"$f":"X8&Y8&Z8&AA8&\"）\"","v":"STEP-3：影響円D範囲(c≦D<Dmax）"},null,null,"STEP-3：影響円D範囲(",{"$f":"AA7","v":"c"},"≦D<",{"$f":"VLOOKUP(R9,$M$19:$R$22,6,FALSE)","v":"Dmax"}]
[null,null,null,null,null,null,null,null,null,null,null,null,"計画高","原地盤高",null,null,4,{"$f":"SMALL($M$18:$M$22,Q9)","v":2.8749999999999996},{"$f":"SMALL($N$18:$N$22,Q9)","v":10.715674033838761},0,"計算範囲外"]
[null,null,null,null,null,null,null,null,null,null,null,null,{"$f":"INDIRECT(\"'\"&$L$1&\"'!\"&O10)","v":2.59},{"$f":"INDIRECT(\"'\"&$L$1&\"'!\"&P10)","v":0},"L12","M12",5]
[]
[null,"盛土条件","盛土高さ",null,"Ｈe",{"$f":"INDIRECT(\"'\"&$L$1&\"'!\"&L8)","v":2.59},"m",{"$f":"+IF(AND(M10=\"\",N10=\"\"),\"\",\"ＦH＝\"&FIXED(M10,2)&\"m，ＧL＝\"&FIXED(N10,2)&\"m\")","v":"ＦH＝2.59m，ＧL＝0.00m"},null,null,null,"F15","D15",null,null,null,null,null,null,"Case1",{"$f":"IF(P26<=Q26,\"〇\",\"-\")","v":"〇"},"a≦b",3]
[null,"塑性角","改良形式：",{"$f":"INDIRECT(\"'\"&$L$1&\"'!\"&M12)","v":"浮き型"},"θ",{"$f":"INDIRECT(\"'\"&$L$1&\"'!\"&L12)","v":85},"度",null,null,null,null,null,"D16",null,null,null,null,null,null,"Case2",{"$f":"IF(AND(P26>Q26,R26>=P26),\"〇\",\"-\")","v":"-"},"a<b≦c",4]
[null,null,"補助工法：",{"$f":"INDIRECT(\"'\"&$L$1&\"'!\"&M13)","v":"浅層改良"},null,{"$f":"INDIRECT(\"'\"&$L$1&\"'!\"&M13)","v":"浅層改良"},null,null,null,null,null,null,null,null,null,null,null,null,null,"Case3",{"$f":"IF(R26<P26,\"〇\",\"-\")","v":"-"},"c<a",5]
[null,null,null,null,null,null,null,null,null,null,null,null,"Case1：b≦aの場合",null,3,4,5]
[null,"影響円D","影響円直径D","その時の高さ","高さ:計算例","面積:計算例","概要",null,null,null,null,null,null,"その時の高さ","面積",null,null,"影響円直径D",null,null,null,null,null,null,null,null,null,null,null,null,null,"その時の高さ","面積","影響円直径D",null,null,null,null,null,null,null,null,null,null,null,null,null,null,null,"その時の高さ","面積","影響円直径D"]
[null,{"$f":"Y6","v":"d"},{"$f":"R6","v":1},0,{"$f":"D17","v":0},{"$f":"F67","v":2.2523009183012754},"STEP0 …底面積A0",null,null,null,null,null,null,null,"case1","Case2","case3",null,null,null,null,null,null,null,null,null,null,null,null,null,null,null,"case2",null,null,null,null,null,null,null,null,null,null,null,null,null,null,null,null,null,"case3"]
[null,{"$f":"Y7","v":"a"},2.2999999999999998,7.4295339967948753,{"$f":"D18","v":7.4295339967948753},{"$f":"E110","v":0.5676218578137493},"STEP1 …底面積A1",null,null,null,null,null,{"$f":"N26","v":1},{"$f":"(M18-N26)/2*TAN(V26)","v":0},{"$f":"Y26","v":2.2523009183012754},{"$f":"AQ26","v":2.2523009183012754},{"$f":"BI26","v":2.2523009183012754},"d",null,{"$f":"O18","v":2.2523009183012754},"STEP-0：底面積（d=D）",null,null,null,null,null,null,null,null,null,{"$f":"AF26","v":1},{"$f":"(AE18-AF26)/2*TAN(AN26)","v":0},{"$f":"AQ26","v":2.2523009183012754},"d",null,null,null,null,"STEP-0：底面積",null,null,null,null,null,null,null,null,null,{"$f":"AX26","v":1},{"$f":"(AW18-AX26)/2*TAN(BF26)","v":0},{"$f":"BI26","v":2.2523009183012754},"d",null,null,null,null,"STEP-0：底面積"]
[null,{"$f":"Y8","v":"c"},2.5714781741247581,8.9810388614469456,{"$f":"D19","v":8.9810388614469456},{"$f":"I153","v":4.8277322267186396E-2},"STEP2 …底面積A2",null,null,null,null,null,{"$f":"P26","v":2.2999999999999998},{"$f":"(M19-N26)/2*TAN(V26)","v":7.4295339967948753},{"$f":"U29","v":1.815711867822569},{"$f":"AM29","v":1.815711867822569},{"$f":"BL34","v":{"$error":"#NUM!"}},"a",{"$f":"O18","v":2.2523009183012754},{"$f":"O19","v":1.815711867822569},"STEP-1影響円Dの範囲（d≦D≦a）左右が接するまで",null,null,null,null,"☆",null,null,null,null,{"$f":"AH26","v":2.2999999999999998},{"$f":"(AE19-AF26)/2*TAN(AN26)","v":7.4295339967948753},{"$f":"AM29","v":1.815711867822569},"a",null,null,null,null,"STEP-1影響円Dの範囲（d≦D≦a）左右が接するまで",null,null,null,null,null,null,null,null,null,{"$f":"AZ26","v":2.2999999999999998},{"$f":"(AW19-AX26)/2*TAN(BF26)","v":7.4295339967948753},{"$f":"BL34","v":{"$error":"#NUM!"}},"a",null,null,null,null,"STEP-1影響円Dの範囲（d≦D≦c）上下が接するまで"]
[null,"Dmax",2.8749999999999996,10.715674033838761,{"$f":"D20","v":10.715674033838761},{"$f":"J196","v":0},"STEP3 …底面積A3",null,null,null,null,null,{"$f":"IF(R26=M19,R26+0.00001,R26)","v":2.5714781741247581},{"$f":"(M20-N26)/2*TAN(V26)","v":8.9810388614469456},{"$f":"AB34","v":{"$error":"#NUM!"}},{"$f":"AT34","v":{"$error":"#NUM!"}},{"$f":"BE29","v":1.815711867822569},"c",{"$f":"O20","v":{"$error":"#NUM!"}},{"$f":"O20","v":{"$error":"#NUM!"}},"STEP-2影響円Dの範囲（a≦D≦c）上下が接するまで",null,null,null,null,"I26",{"$f":"INDIRECT(\"'\"&$Z$19&\"'!\"&Z20)","v":2.59},null,null,null,{"$f":"IF(AJ26=AE19,AJ26+0.00001,AJ26)","v":2.5714781741247581},{"$f":"(AE20-AF26)/2*TAN(AN26)","v":8.9810388614469456},{"$f":"AT34","v":{"$error":"#NUM!"}},"c",null,null,null,null,"STEP-2影響円Dの範囲（a≦D≦c）上下が接するまで",null,null,null,null,null,null,null,null,null,{"$f":"IF(BB26=AW19,BB26+0.00001,BB26)","v":2.5714781741247581},{"$f":"(AW20-AX26)/2*TAN(BF26)","v":8.9810388614469456},{"$f":"BE29","v":1.815711867822569},"c",null,null,null,null,"STEP-2影響円Dの範囲（c≦D≦a）左右が接するまで"]
[null,"---","---","end",null,null,null,null,null,null,null,null,{"$f":"P26/(COS(PI()/2-Z26))","v":2.8749999999999996},{"$f":"(M21-N26)/2*TAN(V26)","v":10.715674033838761},{"$f":"AB39","v":{"$error":"#NUM!"}},{"$f":"AT39","v":{"$error":"#NUM!"}},{"$f":"BL39","v":{"$error":"#NUM!"}},"Dmax",{"$f":"O19","v":1.815711867822569},{"$f":"O21","v":{"$error":"#NUM!"}},"STEP-3影響円Dの範囲（c≦D≦Dmax）３つの影響円が1点で交わるまで",null,null,null,null,"採用値",null,null,null,null,{"$f":"AH26/(COS(PI()/2-AR26))","v":2.8749999999999996},{"$f":"(AE21-AF26)/2*TAN(AN26)","v":10.715674033838761},{"$f":"AT39","v":{"$error":"#NUM!"}},"Dmax",null,null,null,null,"STEP-3影響円Dの範囲（c≦D≦Dmax）３つの影響円が1点で交わるまで",null,null,null,null,null,null,null,null,null,{"$f":"AZ26/(COS(PI()/2-BJ26))","v":2.8749999999999996},{"$f":"(AW21-AX26)/2*TAN(BF26)","v":10.715674033838761},{"$f":"BL39","v":{"$error":"#NUM!"}},"Dmax",null,null,null,null,"STEP-3影響円Dの範囲（c≦D≦Dmax）３つの影響円が1点で交わるまで"]
[null,null,null,null,null,null,null,null,null,null,null,null,null,null,null,null,null,null,{"$f":"O21","v":{"$error":"#NUM!"}},{"$f":"P22","v":0},"計算範囲外",null,null,null,null,"高さ","面積","step",null,null,null,null,null,null,null,null,null,null,"計算範囲外",null,null,null,null,null,null,null,null,null,null,null,null,null,null,null,null,null,"計算範囲外"]
[null,null,null,null,null,null,null,null,null,null,null,null,null,null,null,null,null,null,null,null,null,null,null,null,null,{"$f":"INDIRECT(\"'\"&$Z$19&\"'!\"&Z20)","v":2.59},{"$f":"IF(Z23=0,T5,VLOOKUP(Z23,S5:T9,2,TRUE))","v":1.815711867822569},{"$f":"IF(Z23=0,U5,VLOOKUP(Z23,S5:U9,3,TRUE))","v":"STEP-1：影響円D範囲(d≦D<a）"}]
[null,null,null,null,null,null,null,null,null,null,null,null,"STEP-0：底面積",null,null,null,null,null,null,null,null,null,null,null,null,null,null,null,null,null,"STEP-0：底面積",null,null,null,null,null,null,null,null,null,null,null,null,null,null,null,null,null,"STEP-0：底面積"]
[null,null,null,null,null,null,{"$f":"U8","v":"STEP-3：影響円D範囲(c≦D<Dmax）"},null,null,null,null,null,"項目","杭径：ｄ","杭面積","底辺：a","高さ：b","斜辺：c","面積：ab","改良率","塑性角：θ","ラジアン","高さ：H","影響円：D","面積A0","α","β",null,null,null,"項目","杭径：ｄ","杭面積","底辺：a","高さ：b","斜辺：c","面積：ab","改良率","塑性角：θ","ラジアン","高さ：H","影響円：D","面積A0","α","β",null,null,null,"項目","杭径：ｄ","杭面積","底辺：a","高さ：b","斜辺：c","面積：ab","改良率","塑性角：θ","ラジアン","高さ：H","影響円：D","面積A0","α","β"]
[null,null,null,null,null,null,null,null,null,null,null,null,"数値",{"$f":"$F$3","v":1},{"$f":"PI()*N26^2/4/2","v":0.39269908169872414},{"$f":"$F$4","v":2.2999999999999998},{"$f":"$F$5","v":2.2999999999999998},{"$f":"SQRT(Q26^2+(P26/2)^2)","v":2.5714781741247581},{"$f":"P26*Q26/2","v":2.6449999999999996},{"$f":"(O26/S26)","v":0.14846846188987683},{"$f":"$F$13","v":85},{"$f":"RADIANS(U26)","v":1.4835298641951802},{"$f":"$Z$23","v":2.59},{"$f":"N26+2*W26/TAN(V26)","v":1.4531912770642861},{"$f":"S26-O26","v":2.2523009183012754},{"$f":"PI()-AA26*2","v":0.9272952180016123},{"$f":"ATAN(Q26/(P26/2))","v":1.1071487177940904},null,null,null,"数値",{"$f":"$F$3","v":1},{"$f":"PI()*AF26^2/4/2","v":0.39269908169872414},{"$f":"$F$4","v":2.2999999999999998},{"$f":"$F$5","v":2.2999999999999998},{"$f":"SQRT(AI26^2+(AH26/2)^2)","v":2.5714781741247581},{"$f":"AH26*AI26/2","v":2.6449999999999996},{"$f":"(AG26/AK26)","v":0.14846846188987683},{"$f":"$F$13","v":85},{"$f":"RADIANS(AM26)","v":1.4835298641951802},{"$f":"$Z$23","v":2.59},{"$f":"AF26+2*AO26/TAN(AN26)","v":1.4531912770642861},{"$f":"AK26-AG26","v":2.2523009183012754},{"$f":"PI()-AS26*2","v":0.9272952180016123},{"$f":"ATAN(AI26/(AH26/2))","v":1.1071487177940904},null,null,null,"数値",{"$f":"$F$3","v":1},{"$f":"PI()*AX26^2/4/2","v":0.39269908169872414},{"$f":"$F$4","v":2.2999999999999998},{"$f":"$F$5","v":2.2999999999999998},{"$f":"SQRT(BA26^2+(AZ26/2)^2)","v":2.5714781741247581},{"$f":"AZ26*BA26/2","v":2.6449999999999996},{"$f":"(AY26/BC26)","v":0.14846846188987683},{"$f":"$F$13","v":85},{"$f":"RADIANS(BE26)","v":1.4835298641951802},{"$f":"$Z$23","v":2.59},{"$f":"AX26+2*BG26/TAN(BF26)","v":1.4531912770642861},{"$f":"BC26-AY26","v":2.2523009183012754},{"$f":"PI()-BK26*2","v":0.9272952180016123},{"$f":"ATAN(BA26/(AZ26/2))","v":1.1071487177940904}]
[null,null,null,null,null,null,{"$f":"U7","v":"STEP-2：影響円D範囲(a≦D<c）"},null,null,null,null,null,{"$f":"U19","v":"STEP-1影響円Dの範囲（d≦D≦a）左右が接するまで"},null,null,null,null,null,null,null,null,null,null,null,null,null,null,null,null,null,{"$f":"AM19","v":"STEP-1影響円Dの範囲（d≦D≦a）左右が接するまで"},null,null,null,null,null,null,null,null,null,null,null,null,null,null,null,null,null,{"$f":"BE19","v":"STEP-1影響円Dの範囲（d≦D≦c）上下が接するまで"}]
[null,null,null,null,null,null,null,null,null,null,null,null,"斜辺：c","高さ：H","影響円：D","α","β","A1-1","A1-2","2×A1-2","面積A1",null,null,null,null,null,null,null,null,null,"斜辺：c","高さ：H","影響円：D","α","β","A1-1","A1-2","2×A1-2","面積A1",null,null,null,null,null,null,null,null,null,"斜辺：c","高さ：H","影響円：D","α","β","A1-1","A1-2","2×A1-2","面積A1"]
[null,null,null,null,null,null,{"$f":"U6","v":"STEP-1：影響円D範囲(d≦D<a）"},null,null,null,null,null,{"$f":"R26","v":2.5714781741247581},{"$f":"W26","v":2.59},{"$f":"X26","v":1.4531912770642861},{"$f":"Z26","v":0.9272952180016123},{"$f":"AA26","v":1.1071487177940904},{"$f":"P29*O29^2/8","v":0.24477868524263183},{"$f":"Q29*O29^2/8","v":0.29225472346739945},{"$f":"2*S29","v":0.58450944693479889},{"$f":"S26-R29-T29","v":1.815711867822569},null,null,null,null,null,null,null,null,null,{"$f":"AJ26","v":2.5714781741247581},{"$f":"AO26","v":2.59},{"$f":"AP26","v":1.4531912770642861},{"$f":"AR26","v":0.9272952180016123},{"$f":"AS26","v":1.1071487177940904},{"$f":"AH29*AG29^2/8","v":0.24477868524263183},{"$f":"AI29*AG29^2/8","v":0.29225472346739945},{"$f":"2*AK29","v":0.58450944693479889},{"$f":"AK26-AJ29-AL29","v":1.815711867822569},null,null,null,null,null,null,null,null,null,{"$f":"BB26","v":2.5714781741247581},{"$f":"BG26","v":2.59},{"$f":"BH26","v":1.4531912770642861},{"$f":"BJ26","v":0.9272952180016123},{"$f":"BK26","v":1.1071487177940904},{"$f":"AZ29*AY29^2/8","v":0.24477868524263183},{"$f":"BA29*AY29^2/8","v":0.29225472346739945},{"$f":"2*BC29","v":0.58450944693479889},{"$f":"BC26-BB29-BD29","v":1.815711867822569}]
[null,null,null,null,null,null,null,null,null,null,null,null,{"$f":"U20","v":"STEP-2影響円Dの範囲（a≦D≦c）上下が接するまで"},null,null,null,null,null,null,null,null,null,null,null,null,null,null,null,null,null,{"$f":"AM20","v":"STEP-2影響円Dの範囲（a≦D≦c）上下が接するまで"},null,null,null,null,null,null,null,null,null,null,null,null,null,null,null,null,null,{"$f":"BE20","v":"STEP-2影響円Dの範囲（c≦D≦a）左右が接するまで"}]
[null,null,null,null,null,null,{"$f":"U5","v":"STEP-0：底面積（d=D）"},null,null,null,null,null,"Dmax",{"$f":"P25","v":"底辺：a"},{"$f":"Q25","v":"高さ：b"},"斜辺：c","高さ：H","影響円：D","α","β2-1","β2-2",null,"ｈ2-1","ｈ2-2","A2-1","A2-2","A2-3",null,null,null,"Dmax",{"$f":"AH25","v":"底辺：a"},{"$f":"AI25","v":"高さ：b"},"斜辺：c","高さ：H","影響円：D","α","β2-1","β2-2",null,"ｈ3-1","ｈ2-2","A2-1","A2-2","A2-3",null,null,null,"Dmax",{"$f":"AZ25","v":"底辺：a"},{"$f":"BA25","v":"高さ：b"},"斜辺：c","高さ：H","影響円：D","α2-1","α2-2","β2-1",null,"ｈ2-1",null,"A2-1","A2-2","A2-3"]
[null,null,null,null,null,null,null,null,null,null,null,null,{"$f":"P26/(COS(PI()/2-Z26))","v":2.8749999999999996},{"$f":"P26","v":2.2999999999999998},{"$f":"Q26","v":2.2999999999999998},{"$f":"R26","v":2.5714781741247581},{"$f":"W26","v":2.59},{"$f":"X26","v":1.4531912770642861},{"$f":"Z26","v":0.9272952180016123},{"$f":"AA26-U32","v":{"$error":"#NUM!"}},{"$f":"ACOS(N32/R32)","v":{"$error":"#NUM!"}},null,null,{"$f":"N32/2*TAN(U32)","v":{"$error":"#NUM!"}},{"$f":"S32*R32^2/8","v":0.24477868524263183},{"$f":"T32*R32^2/8","v":{"$error":"#NUM!"}},{"$f":"X32*N32/2","v":{"$error":"#NUM!"}},null,null,null,{"$f":"AH26/(COS(PI()/2-AR26))","v":2.8749999999999996},{"$f":"AH26","v":2.2999999999999998},{"$f":"AI26","v":2.2999999999999998},{"$f":"AJ26","v":2.5714781741247581},{"$f":"AO26","v":2.59},{"$f":"AP26","v":1.4531912770642861},{"$f":"AR26","v":0.9272952180016123},{"$f":"ACOS(AF32/AJ32)","v":{"$error":"#NUM!"}},{"$f":"AS26-AL32","v":{"$error":"#NUM!"}},null,null,{"$f":"AF32/2*TAN(AL32)","v":{"$error":"#NUM!"}},{"$f":"AK32*AJ32^2/8","v":0.24477868524263183},{"$f":"AM32*AJ32^2/8","v":{"$error":"#NUM!"}},{"$f":"AP32*AF32/2","v":{"$error":"#NUM!"}},null,null,null,{"$f":"AZ26/(COS(PI()/2-BJ26))","v":2.8749999999999996},{"$f":"AZ26","v":2.2999999999999998},{"$f":"BA26","v":2.2999999999999998},{"$f":"BB26","v":2.5714781741247581},{"$f":"BG26","v":2.59},{"$f":"BH26","v":1.4531912770642861},{"$f":"ACOS(AZ32/BB32)","v":{"$error":"#NUM!"}},{"$f":"BJ26-2*BC32","v":{"$error":"#NUM!"}},{"$f":"BK26-BC32","v":{"$error":"#NUM!"}},null,{"$f":"AZ32/2*TAN(BC32)","v":{"$error":"#NUM!"}},null,{"$f":"BE32*BB32^2/8","v":{"$error":"#NUM!"}},{"$f":"BD32*BB32^2/8","v":{"$error":"#NUM!"}},{"$f":"BG32*AZ32/2","v":{"$error":"#NUM!"}}]
[null,null,null,null,null,null,null,null,null,null,null,null,null,null,null,null,null,null,null,null,null,null,"A2-1","2×A2-2","A2-3",null,"ΣA2","面積A2",null,null,null,null,null,null,null,null,null,null,null,null,"A2-1","2×A2-2","A2-3",null,"ΣA2","面積A2",null,null,null,null,null,null,null,null,null,null,null,null,"2×A2-1","A2-2","2×A2-3",null,"ΣA2","面積A2"]
[null,null,null,null,null,null,null,null,null,null,null,null,null,null,null,null,null,null,null,null,null,null,{"$f":"Y32","v":0.24477868524263183},{"$f":"Z32*2","v":{"$error":"#NUM!"}},{"$f":"AA32","v":{"$error":"#NUM!"}},null,{"$f":"SUM(W34:Y34)","v":{"$error":"#NUM!"}},{"$f":"S26-AA34","v":{"$error":"#NUM!"}},null,null,null,null,null,null,null,null,null,null,null,null,{"$f":"AQ32","v":0.24477868524263183},{"$f":"AR32*2","v":{"$error":"#NUM!"}},{"$f":"AS32","v":{"$error":"#NUM!"}},null,{"$f":"SUM(AO34:AQ34)","v":{"$error":"#NUM!"}},{"$f":"AK26-AS34","v":{"$error":"#NUM!"}},null,null,null,null,null,null,null,null,null,null,null,null,{"$f":"BI32*2","v":{"$error":"#NUM!"}},{"$f":"BJ32","v":{"$error":"#NUM!"}},{"$f":"2*BK32","v":{"$error":"#NUM!"}},null,{"$f":"SUM(BG34:BI34)","v":{"$error":"#NUM!"}},{"$f":"BC26-BK34","v":{"$error":"#NUM!"}}]
[null,null,null,null,null,null,null,null,null,null,null,null,{"$f":"U21","v":"STEP-3影響円Dの範囲（c≦D≦Dmax）３つの影響円が1点で交わるまで"},null,null,null,null,null,null,null,null,null,null,null,null,null,null,null,null,null,{"$f":"AM21","v":"STEP-3影響円Dの範囲（c≦D≦Dmax）３つの影響円が1点で交わるまで"},null,null,null,null,null,null,null,null,null,null,null,null,null,null,null,null,null,{"$f":"BE21","v":"STEP-3影響円Dの範囲（c≦D≦Dmax）３つの影響円が1点で交わるまで"}]
[null,null,null,null,null,null,null,null,null,null,null,null,"Dmax","底辺：a","高さ：ｂ","斜辺：ｃ","高さ：H","影響円：D","α3","β3-1","β3-2","β3-3","ｈ3-1","ｈ3-2","A3-1","A3-2","A3-3","A3-4",null,null,"Dmax","底辺：a","高さ：ｂ","斜辺：ｃ","高さ：H","影響円：D","α3","β3-1","β3-2","β3-3","ｈ3-1","ｈ3-2","A3-1","A3-2","A3-3","A3-4",null,null,"Dmax","底辺：a","高さ：ｂ","斜辺：ｃ","高さ：H","影響円：D","α3","β3-1","β3-2","β3-3","ｈ3-1","ｈ3-2","A3-1","A3-2","A3-3","A3-4"]
[null,null,null,null,null,null,null,null,null,null,null,null,{"$f":"P26/(COS(PI()/2-Z26))","v":2.8749999999999996},{"$f":"P26","v":2.2999999999999998},{"$f":"Q26","v":2.2999999999999998},{"$f":"R26","v":2.5714781741247581},{"$f":"W26","v":2.59},{"$f":"X26","v":1.4531912770642861},{"$f":"Z26-2*U37","v":{"$error":"#NUM!"}},{"$f":"ACOS(N37/R37)","v":{"$error":"#NUM!"}},{"$f":"ACOS(P37/R37)","v":{"$error":"#NUM!"}},{"$f":"AA26-T37-U37","v":{"$error":"#NUM!"}},{"$f":"P37/2*TAN(U37)","v":{"$error":"#NUM!"}},{"$f":"N37/2*TAN(T37)","v":{"$error":"#NUM!"}},{"$f":"V37*R37^2/8","v":{"$error":"#NUM!"}},{"$f":"S37*R37^2/8","v":{"$error":"#NUM!"}},{"$f":"W37*P37/2","v":{"$error":"#NUM!"}},{"$f":"X37*N37/2","v":{"$error":"#NUM!"}},null,null,{"$f":"AH26/(COS(PI()/2-AR26))","v":2.8749999999999996},{"$f":"AH26","v":2.2999999999999998},{"$f":"AI26","v":2.2999999999999998},{"$f":"AJ26","v":2.5714781741247581},{"$f":"AO26","v":2.59},{"$f":"AP26","v":1.4531912770642861},{"$f":"AR26-2*AM37","v":{"$error":"#NUM!"}},{"$f":"ACOS(AF37/AJ37)","v":{"$error":"#NUM!"}},{"$f":"ACOS(AH37/AJ37)","v":{"$error":"#NUM!"}},{"$f":"AS26-AL37-AM37","v":{"$error":"#NUM!"}},{"$f":"AH37/2*TAN(AM37)","v":{"$error":"#NUM!"}},{"$f":"AF37/2*TAN(AL37)","v":{"$error":"#NUM!"}},{"$f":"AN37*AJ37^2/8","v":{"$error":"#NUM!"}},{"$f":"AK37*AJ37^2/8","v":{"$error":"#NUM!"}},{"$f":"AO37*AH37/2","v":{"$error":"#NUM!"}},{"$f":"AP37*AF37/2","v":{"$error":"#NUM!"}},null,null,{"$f":"AZ26/(COS(PI()/2-BJ26))","v":2.8749999999999996},{"$f":"AZ26","v":2.2999999999999998},{"$f":"BA26","v":2.2999999999999998},{"$f":"BB26","v":2.5714781741247581},{"$f":"BG26","v":2.59},{"$f":"BH26","v":1.4531912770642861},{"$f":"BJ26-2*BE37","v":{"$error":"#NUM!"}},{"$f":"ACOS(AX37/BB37)","v":{"$error":"#NUM!"}},{"$f":"ACOS(AZ37/BB37)","v":{"$error":"#NUM!"}},{"$f":"BK26-BD37-BE37","v":{"$error":"#NUM!"}},{"$f":"AZ37/2*TAN(BE37)","v":{"$error":"#NUM!"}},{"$f":"AX37/2*TAN(BD37)","v":{"$error":"#NUM!"}},{"$f":"BF37*BB37^2/8","v":{"$error":"#NUM!"}},{"$f":"BC37*BB37^2/8","v":{"$error":"#NUM!"}},{"$f":"BG37*AZ37/2","v":{"$error":"#NUM!"}},{"$f":"BH37*AX37/2","v":{"$error":"#NUM!"}}]
[null,null,null,null,null,null,null,null,null,null,null,null,null,null,null,null,null,null,null,null,null,null,"2×A3-1","A3-2","2×A3-3","A3-4","ΣA3","面積A3",null,null,null,null,null,null,null,null,null,null,null,null,"2×A3-1","A3-2","2×A3-3","A3-4","ΣA3","面積A3",null,null,null,null,null,null,null,null,null,null,null,null,"2×A3-1","A3-2","2×A3-3","A3-4","ΣA3","面積A3"]
[null,null,null,null,null,null,null,null,null,null,null,null,null,null,null,null,null,null,null,null,null,null,{"$f":"Y37*2","v":{"$error":"#NUM!"}},{"$f":"Z37","v":{"$error":"#NUM!"}},{"$f":"2*AA37","v":{"$error":"#NUM!"}},{"$f":"AB37","v":{"$error":"#NUM!"}},{"$f":"SUM(W39:Z39)","v":{"$error":"#NUM!"}},{"$f":"S26-AA39","v":{"$error":"#NUM!"}},null,null,null,null,null,null,null,null,null,null,null,null,{"$f":"AQ37*2","v":{"$error":"#NUM!"}},{"$f":"AR37","v":{"$error":"#NUM!"}},{"$f":"2*AS37","v":{"$error":"#NUM!"}},{"$f":"AT37","v":{"$error":"#NUM!"}},{"$f":"SUM(AO39:AR39)","v":{"$error":"#NUM!"}},{"$f":"AK26-AS39","v":{"$error":"#NUM!"}},null,null,null,null,null,null,null,null,null,null,null,null,{"$f":"BI37*2","v":{"$error":"#NUM!"}},{"$f":"BJ37","v":{"$error":"#NUM!"}},{"$f":"2*BK37","v":{"$error":"#NUM!"}},{"$f":"BL37","v":{"$error":"#NUM!"}},{"$f":"SUM(BG39:BJ39)","v":{"$error":"#NUM!"}},{"$f":"BC26-BK39","v":{"$error":"#NUM!"}}]
[]
[]
[]
[]
[]
["STEP-0：底面積"]
[]
[null,"項目","杭径：ｄ","杭面積","長辺：a","短辺：b","斜辺：c","面積：ab/2","改良率"]
[null,"数値",{"$f":"F3","v":1},{"$f":"PI()*C48^2/4/2","v":0.39269908169872414},{"$f":"F4","v":2.2999999999999998},{"$f":"F5","v":2.2999999999999998},{"$f":"SQRT(F48^2+(E48/2)^2)","v":2.5714781741247581},{"$f":"E48*F48/2","v":2.6449999999999996},{"$f":"(D48/H48)","v":0.14846846188987683}]
[]
[]
[]
[]
[]
[]
[]
[]
[]
[]
[]
[]
[]
[]
[]
[]
[]
[null,"塑性角：θ","ラジアン","高さ：H","影響円：D","面積A0","α","β"]
[null,{"$f":"F13","v":85},{"$f":"RADIANS(B67)","v":1.4835298641951802},{"$f":"E17","v":0},{"$f":"$C$48+2*D67/TAN($C$67)","v":1},{"$f":"H48-D48","v":2.2523009183012754},{"$f":"PI()-H67*2","v":0.9272952180016123},{"$f":"ATAN(F48/(E48/2))","v":1.1071487177940904}]
[]
[]
[]
[]
[]
[]
[]
[]
[]
[]
[]
[]
[]
[]
[]
[]
[]
[]
[]
[]
[{"$f":"U6","v":"STEP-1：影響円D範囲(d≦D<a）"}]
[]
[null,"斜辺：c","高さ：H","影響円：D","α","β","面積：ab"]
[null,{"$f":"G48","v":2.5714781741247581},{"$f":"E18","v":7.4295339967948753},{"$f":"$C$48+2*C91/TAN($C$67)","v":2.2999999999999998},{"$f":"G67","v":0.9272952180016123},{"$f":"H67","v":1.1071487177940904},{"$f":"H48","v":2.6449999999999996}]
[]
[null,{"$f":"A88","v":"STEP-1：影響円D範囲(d≦D<a）"}]
[]
[]
[]
[]
[]
[]
[]
[]
[]
[]
[]
[]
[]
[]
[]
[null,"A1-1","A1-2","2×A1-2","面積A1"]
[null,{"$f":"E91*D91^2/8","v":0.61317396290356607},{"$f":"F91*D91^2/8","v":0.73210208964134216},{"$f":"2*C110","v":1.4642041792826843},{"$f":"G91-B110-D110","v":0.5676218578137493}]
[]
[]
[]
[]
[]
[]
[]
[]
[]
[]
[]
[]
[]
[]
[]
[]
[]
[]
[]
[]
[{"$f":"U7","v":"STEP-2：影響円D範囲(a≦D<c）"}]
[null,"上限値"]
[null,{"$f":"E47","v":"長辺：a"},{"$f":"F47","v":"短辺：b"},"斜辺：c","高さ：H","影響円：D","面積：ab","α2","β2-1","β2-2"]
[null,{"$f":"E48","v":2.2999999999999998},{"$f":"F48","v":2.2999999999999998},{"$f":"G48","v":2.5714781741247581},{"$f":"E19","v":8.9810388614469456},{"$f":"$C$48+2*E134/TAN($C$67)","v":2.5714781741247581},{"$f":"H48","v":2.6449999999999996},{"$f":"G67-2*J134","v":0.9272952180016123},{"$f":"F91-J134","v":1.1071487177940904},{"$f":"ACOS(D134/F134)","v":0}]
[]
[null,{"$f":"A131","v":"STEP-2：影響円D範囲(a≦D<c）"}]
[]
[]
[]
[]
[]
[]
[]
[]
[]
[]
[]
[]
[]
[]
[]
[null,"A2-1","A2-2","ｈ2","A2-3","2×A2-1","A2-2","2×A2-3","面積A2"]
[null,{"$f":"I134*F134^2/8","v":0.91512761205167781},{"$f":"H134*F134^2/8","v":0.76646745362945767},{"$f":"D134/2*TAN(J134)","v":0},{"$f":"D153*D134/2","v":0},{"$f":"2*B153","v":1.8302552241033556},{"$f":"C153","v":0.76646745362945767},{"$f":"2*D153","v":0},{"$f":"G134-SUM(F153:H153)","v":4.8277322267186396E-2}]
[]
[]
[]
[]
[]
[]
[]
[]
[]
[]
[]
[]
[]
[]
[]
[]
[]
[]
[]
[]
[{"$f":"U8","v":"STEP-3：影響円D範囲(c≦D<Dmax）"}]
[null,"Dmax",{"$f":"B177/(COS(PI()/2-G67))","v":2.8749999999999996}]
[null,"長辺：a","短辺：ｂ","斜辺：ｃ","高さ：H","影響円：D","α3","β3-1","β3-2","β3-3"]
[null,{"$f":"P26","v":2.2999999999999998},{"$f":"Q26","v":2.2999999999999998},{"$f":"G48","v":2.5714781741247581},{"$f":"E20","v":10.715674033838761},{"$f":"$C$48+2*E177/TAN($C$67)","v":2.8749999999999996},{"$f":"G67-2*I177","v":0},{"$f":"ACOS(B177/F177)","v":0.64350110879328426},{"$f":"ACOS(D177/F177)","v":0.46364760900080593},{"$f":"H67-H177-I177","v":0}]
[]
[null,{"$f":"A174","v":"STEP-3：影響円D範囲(c≦D<Dmax）"}]
[]
[]
[]
[]
[]
[]
[]
[]
[]
[]
[]
[]
[]
[]
[]
[null,"ｈ3-1","ｈ3-2","A3-1","A3-2","A3-3","A3-4","面積：ab","ΣA3","面積A3",null,null,"2×A3-1","A3-2","2×A3-3","A3-4","ΣA3","面積A3"]
[null,{"$f":"D177/2*TAN(I177)","v":0.64286954353118919},{"$f":"B177/2*TAN(H177)","v":0.86249999999999971},{"$f":"J177*F177^2/8","v":0},{"$f":"G177*F177^2/8","v":0},{"$f":"B196*D177/2","v":0.82656249999999953},{"$f":"C196*B177/2","v":0.99187499999999962},{"$f":"H48","v":2.6449999999999996},{"$f":"SUM(M196:P196)","v":2.6449999999999987},{"$f":"H196-I196","v":0},null,null,{"$f":"D196*2","v":0},{"$f":"E196","v":0},{"$f":"2*F196","v":1.6531249999999991},{"$f":"G196","v":0.99187499999999962},{"$f":"SUM(M196:P196)","v":2.6449999999999987},{"$f":"S167-Q196","v":-2.6449999999999987}]
[]
[]
[]
[]
[]
[]
[]
[]
[]
[]
[]
[]
[]
[]
[]
[]
[]
[]
[]
[null,null,null,null,null,null,null,null,null,null,"＊"]

{"sheet":"単軸四角形配置","index":4,"n_rows":216,"n_cols":47,"rows_kept":216,"cut":false,"hidden":false,"merged":[[12,4,13,4],[12,5,13,5],[12,6,13,6],[12,1,13,1],[15,6,15,9],[2,7,2,9],[3,2,4,3],[3,7,3,9],[4,7,4,9],[2,1,7,1],[5,7,5,9],[7,2,7,3],[11,2,11,3],[9,2,9,3],[10,2,10,3],[1,1,1,3],[2,2,2,3]]}
["盛土体積 計算条件",null,null,null,null,null,null,null,null,null,null,"☆","⇦検討条件参照先"]
[null,"項　　　目",null,null,"記号","値","単位","備考",null,null,null,null,null,null,null,null,null,"ー積分計算に使用する部分ー"]
[null,"セメント\nコラム\n改良体","改良体直径",null,"ｄ",{"$f":"INDIRECT(\"'\"&$L$1&\"'!\"&L3)","v":1},"m",null,null,null,null,"F4","改良体直径はd＝0.6～1.3m",null,null,null,null,null,null,{"$f":"VLOOKUP(\"〇\",U12:W14,3,FALSE)","v":3}]
[null,null,"改良体間隔\n (改良体中心間隔)",null,"a",{"$f":"INDIRECT(\"'\"&$L$1&\"'!\"&L4)","v":2.2999999999999998},"〃",null,null,null,null,"F5","改良体間隔はλ＝1.0～2.5m",null,null,null,null,"影響円直径D","その時の高さ","面積","面積計算STEP",null,null,null,"影響円の範囲"]
[null,null,null,null,"b",{"$f":"INDIRECT(\"'\"&$L$1&\"'!\"&L5)","v":2.2999999999999998},"〃",null,null,null,null,"F6","改良率はap＝10%以上",null,null,null,null,null,null,{"$f":"T18","v":4.5046018366025509},{"$f":"U18","v":"STEP-0：底面積（d=D）"}]
[null,null,null,null,null,null,null,null,null,null,null,"F7",null,null,null,null,1,{"$f":"SMALL($M$18:$M$22,Q6)","v":1},{"$f":"SMALL($N$18:$N$22,Q6)","v":0},{"$f":"VLOOKUP(R7,$M$19:$R$21,T3,FALSE)","v":3.6314237356451375},{"$f":"X6&Y6&Z6&AA6&\"）\"","v":"STEP-1：影響円D範囲(d≦D<b）"},null,null,"STEP-1：影響円D範囲(",{"$f":"R18","v":"d"},"≦D<",{"$f":"VLOOKUP(R7,$M$19:$R$22,6,FALSE)","v":"b"},{"$f":"SMALL(OFFSET($M$18,1,$T$3,3,1),Q6)","v":{"$error":"#NUM!"}}]
[null,null,null,null,null,null,null,null,null,null,null,"F8",null,null,null,null,2,{"$f":"SMALL($M$18:$M$22,Q7)","v":2.2999999999999998},{"$f":"SMALL($N$18:$N$22,Q7)","v":7.4295339967948753},{"$f":"VLOOKUP(R8,$M$19:$R$21,T3,FALSE)","v":{"$error":"#NUM!"}},{"$f":"X7&Y7&Z7&AA7&\"）\"","v":"STEP-2：影響円D範囲(b≦D<a）"},null,null,"STEP-2：影響円D範囲(",{"$f":"AA6","v":"b"},"≦D<",{"$f":"VLOOKUP(R8,$M$19:$R$22,6,FALSE)","v":"a"},{"$f":"SMALL(OFFSET($M$18,1,$T$3,3,1),Q7)","v":{"$error":"#NUM!"}}]
[null,null,"改良率",null,"ａp",{"$f":"ROUNDDOWN(S26,3)","v":0.14799999999999999},"-",null,null,null,null,"F13","盛土高",null,null,null,3,{"$f":"SMALL($M$18:$M$22,Q8)","v":2.3001},{"$f":"SMALL($N$18:$N$22,Q8)","v":7.4301054994100149},{"$f":"VLOOKUP(R9,$M$19:$R$21,T3,FALSE)","v":{"$error":"#NUM!"}},{"$f":"X8&Y8&Z8&AA8&\"）\"","v":"STEP-3：影響円D範囲(a≦D<√(a^2+b^2））"},null,null,"STEP-3：影響円D範囲(",{"$f":"AA7","v":"a"},"≦D<",{"$f":"VLOOKUP(R9,$M$19:$R$22,6,FALSE)","v":"√(a^2+b^2）"}]
[null,null,null,null,null,null,null,null,null,null,null,null,"計画高","原地盤高",null,null,4,{"$f":"SMALL($M$18:$M$22,Q9)","v":3.2526911934581184},{"$f":"SMALL($N$18:$N$22,Q9)","v":12.874189081598088},0,"計算範囲外"]
[null,null,null,null,null,null,null,null,null,null,null,null,{"$f":"INDIRECT(\"'\"&$L$1&\"'!\"&O10)","v":2.59},{"$f":"INDIRECT(\"'\"&$L$1&\"'!\"&P10)","v":0},"L12","M12",5]
[]
[null,"盛土条件","盛土高さ",null,"Ｈe",{"$f":"INDIRECT(\"'\"&$L$1&\"'!\"&L8)","v":2.59},"m",{"$f":"+IF(AND(M10=\"\",N10=\"\"),\"\",\"ＦH＝\"&FIXED(M10,2)&\"m，ＧL＝\"&FIXED(N10,2)&\"m\")","v":"ＦH＝2.59m，ＧL＝0.00m"},null,null,null,"F15","D15",null,null,null,null,null,null,"Case1",{"$f":"IF(P26<=O26,\"〇\",\"-\")","v":"〇"},"b≦a",3]
[null,"塑性角","改良形式：",{"$f":"INDIRECT(\"'\"&$L$1&\"'!\"&M12)","v":"浮き型"},"θ",{"$f":"INDIRECT(\"'\"&$L$1&\"'!\"&L12)","v":85},"度",null,null,null,null,null,"D16",null,null,null,null,null,null,"Case2",{"$f":"IF(AND(P26>O26),\"〇\",\"-\")","v":"-"},"a<b",4]
[null,null,"補助工法：",{"$f":"INDIRECT(\"'\"&$L$1&\"'!\"&M13)","v":"浅層改良"},null,{"$f":"INDIRECT(\"'\"&$L$1&\"'!\"&M13)","v":"浅層改良"},null,null,null,null,null,null,null,null,null,null,null,null,null,"Case3","-","---",5]
[null,null,null,null,null,null,null,null,null,null,null,null,"Case1：b≦aの場合",null,3,4,5,null,null,null,null,null,null,null,null,null,null,null,null,null,"Case1：a<bの場合",null,3,4,5]
[null,"影響円D","影響円直径D","その時の高さ","高さ:計算例","面積:計算例","概要",null,null,null,null,null,null,"その時の高さ","面積",null,null,"影響円直径D",null,null,null,null,null,null,null,null,null,null,null,null,null,"その時の高さ","面積",null,null,"影響円直径D"]
[null,{"$f":"Y6","v":"d"},{"$f":"R6","v":1},0,0,{"$f":"F67","v":4.5046018366025509},"STEP0 …底面積A0",null,null,null,null,null,null,null,"case1","Case2","case3",null,null,null,null,null,null,null,null,null,null,null,null,null,null,null,"Case2"]
[null,{"$f":"Y7","v":"b"},2.2999999999999998,7.4295339967948753,{"$f":"D18","v":7.4295339967948753},{"$f":"C110","v":1.1352437156274986},"STEP1 …底面積A1",null,null,null,null,null,{"$f":"N26","v":1},{"$f":"(M18-N26)/2*TAN(U26)","v":0},{"$f":"X26","v":4.5046018366025509},{"$f":"AP26","v":4.5046018366025509},null,"d",null,{"$f":"O18","v":4.5046018366025509},"STEP-0：底面積（d=D）",null,null,null,null,null,null,null,null,null,{"$f":"AF26","v":1},{"$f":"(AE18-AF26)/2*TAN(AM26)","v":0},{"$f":"AP26","v":4.5046018366025509},null,null,"d",null,{"$f":"P18","v":4.5046018366025509},"STEP-0：底面積"]
[null,{"$f":"Y8","v":"a"},2.3001,7.4301054994100149,{"$f":"D19","v":7.4301054994100149},{"$f":"G153","v":1.1348838544808171},"STEP2 …底面積A2",null,null,null,null,null,{"$f":"P26","v":2.2999999999999998},{"$f":"(M19-N26)/2*TAN(U26)","v":7.4295339967948753},{"$f":"Q29","v":3.6314237356451375},{"$f":"AP32","v":{"$error":"#NUM!"}},null,"b",{"$f":"N18","v":0},{"$f":"O19","v":3.6314237356451375},"STEP-1：上下（短辺b）が接するまで",null,null,null,null,"☆",null,null,null,null,{"$f":"AH26","v":2.2999999999999998},{"$f":"(AE19-AF26)/2*TAN(AM26)","v":7.4295339967948753},{"$f":"AP32","v":{"$error":"#NUM!"}},null,null,"b",{"$f":"AF18","v":0},{"$f":"P19","v":{"$error":"#NUM!"}},"STEP-1：左右（短辺a）が接するまで"]
[null,"√(a2+b2）",3.2526911934581184,12.874189081598088,{"$f":"D20","v":12.874189081598088},{"$f":"J196","v":8.8817841970012523E-16},"STEP3 …底面積A3",null,null,null,null,null,{"$f":"IF(O26=P26,O26+0.0001,O26)","v":2.3001},{"$f":"(M20-N26)/2*TAN(U26)","v":7.4301054994100149},{"$f":"X32","v":{"$error":"#NUM!"}},{"$f":"AI29","v":3.6314237356451375},null,"a",{"$f":"N19","v":7.4295339967948753},{"$f":"O20","v":{"$error":"#NUM!"}},"STEP-2：左右（長辺a）が接するまで",null,null,null,null,"I26",{"$f":"INDIRECT(\"'\"&$Z$19&\"'!\"&Z20)","v":2.59},null,null,null,{"$f":"IF(AG26=AH26,AG26+0.0001,AG26)","v":2.3001},{"$f":"(AE20-AF26)/2*TAN(AM26)","v":7.4301054994100149},{"$f":"AI29","v":3.6314237356451375},null,null,"a",{"$f":"AF19","v":7.4295339967948753},{"$f":"P20","v":3.6314237356451375},"STEP-2：上下（長辺b）が接するまで"]
[null,"---","---","end",null,null,null,null,null,null,null,null,{"$f":"SQRT(O26^2+P26^2)","v":3.2526911934581184},{"$f":"(M21-N26)/2*TAN(U26)","v":12.874189081598088},{"$f":"AC35","v":{"$error":"#NUM!"}},{"$f":"AU35","v":{"$error":"#NUM!"}},null,"√(a^2+b^2）",{"$f":"N20","v":7.4301054994100149},{"$f":"O21","v":{"$error":"#NUM!"}},"STEP-3：対角が接するまで",null,null,null,null,"採用値",null,null,null,null,{"$f":"SQRT(AG26^2+AH26^2)","v":3.2526911934581184},{"$f":"(AE21-AF26)/2*TAN(AM26)","v":12.874189081598088},{"$f":"AU35","v":{"$error":"#NUM!"}},null,null,"√(a2+b2）",{"$f":"AF20","v":7.4301054994100149},{"$f":"P21","v":{"$error":"#NUM!"}},"STEP-3：対角が接するまで"]
[null,null,null,null,null,null,null,null,null,null,null,null,null,null,null,null,null,null,{"$f":"N21","v":12.874189081598088},{"$f":"R22","v":0},"計算範囲外",null,null,null,null,"高さ","面積","step",null,null,null,null,null,null,null,null,{"$f":"AF21","v":12.874189081598088},{"$f":"AJ22","v":0},"計算範囲外"]
[null,null,null,null,null,null,null,null,null,null,null,null,null,null,null,null,null,null,null,null,null,null,null,null,null,{"$f":"INDIRECT(\"'\"&$Z$19&\"'!\"&Z20)","v":2.59},{"$f":"IF(Z23=0,T5,VLOOKUP(Z23,S5:T9,2,TRUE))","v":3.6314237356451375},{"$f":"IF(Z23=0,U5,VLOOKUP(Z23,S5:U9,3,TRUE))","v":"STEP-1：影響円D範囲(d≦D<b）"}]
[null,null,null,null,null,null,null,null,null,null,null,null,{"$f":"U18","v":"STEP-0：底面積（d=D）"},null,null,null,null,null,null,null,null,null,null,null,null,null,null,null,null,null,{"$f":"AM18","v":"STEP-0：底面積"}]
[null,null,null,null,null,null,{"$f":"U8","v":"STEP-3：影響円D範囲(a≦D<√(a^2+b^2））"},null,null,null,null,null,"項目","杭径：ｄ","縦辺：a","横辺：b","面積","面積：ab","改良率","塑性角：θ","ラジアン","高さ：H","影響円：D","面積A0",null,null,null,null,null,null,"項目","杭径：ｄ","縦辺：a","横辺：b","面積","面積：ab","改良率","塑性角：θ","ラジアン","高さ：H","影響円：D","面積A0"]
[null,null,null,null,null,null,null,null,null,null,null,null,"数値",{"$f":"$F$3","v":1},{"$f":"$F$4","v":2.2999999999999998},{"$f":"$F$5","v":2.2999999999999998},{"$f":"PI()*N26^2/4","v":0.78539816339744828},{"$f":"O26*P26","v":5.2899999999999991},{"$f":"(Q26/R26)","v":0.14846846188987683},{"$f":"$F$13","v":85},{"$f":"RADIANS(T26)","v":1.4835298641951802},{"$f":"$Z$23","v":2.59},{"$f":"N26+2*V26/TAN(U26)","v":1.4531912770642861},{"$f":"R26-Q26","v":4.5046018366025509},null,null,null,null,null,null,"数値",{"$f":"$F$3","v":1},{"$f":"$F$4","v":2.2999999999999998},{"$f":"$F$5","v":2.2999999999999998},{"$f":"PI()*AF26^2/4","v":0.78539816339744828},{"$f":"AG26*AH26","v":5.2899999999999991},{"$f":"(AI26/AJ26)","v":0.14846846188987683},{"$f":"$F$13","v":85},{"$f":"RADIANS(AL26)","v":1.4835298641951802},{"$f":"$Z$23","v":2.59},{"$f":"AF26+2*AN26/TAN(AM26)","v":1.4531912770642861},{"$f":"AJ26-AI26","v":4.5046018366025509}]
[null,null,null,null,null,null,{"$f":"U7","v":"STEP-2：影響円D範囲(b≦D<a）"},null,null,null,null,null,{"$f":"U19","v":"STEP-1：上下（短辺b）が接するまで"},null,null,null,null,null,null,null,null,null,null,null,null,null,null,null,null,null,{"$f":"AM19","v":"STEP-1：左右（短辺a）が接するまで"}]
[null,null,null,null,null,null,null,null,null,null,null,null,{"$f":"P25","v":"横辺：b"},"高さ：H","影響円：D","4×A1-1","面積A1",null,null,null,null,null,null,null,null,null,null,null,null,null,{"$f":"AG25","v":"縦辺：a"},"高さ：H","影響円：D","4×A1-1","面積A1"]
[null,null,null,null,null,null,{"$f":"U6","v":"STEP-1：影響円D範囲(d≦D<b）"},null,null,null,null,null,{"$f":"P26","v":2.2999999999999998},{"$f":"V26","v":2.59},{"$f":"W26","v":1.4531912770642861},{"$f":"PI()*O29^2/4","v":1.6585762643548614},{"$f":"R26-P29","v":3.6314237356451375},null,null,null,null,null,null,null,null,null,null,null,null,null,{"$f":"AG26","v":2.2999999999999998},{"$f":"AN26","v":2.59},{"$f":"AO26","v":1.4531912770642861},{"$f":"PI()*AG29^2/4","v":1.6585762643548614},{"$f":"AJ26-AH29","v":3.6314237356451375}]
[null,null,null,null,null,null,null,null,null,null,null,null,{"$f":"U20","v":"STEP-2：左右（長辺a）が接するまで"},null,null,null,null,null,null,null,null,null,null,null,null,null,null,null,null,null,{"$f":"AM20","v":"STEP-2：上下（長辺b）が接するまで"}]
[null,null,null,null,null,null,{"$f":"U5","v":"STEP-0：底面積（d=D）"},null,null,null,null,null,{"$f":"O25","v":"縦辺：a"},{"$f":"P25","v":"横辺：b"},"高さ：H","影響円：D","α","α'","ｈ1","A2-1","A2-2","2×A2-1","4×A2-2","面積A2",null,null,null,null,null,null,{"$f":"AG25","v":"縦辺：a"},{"$f":"AH25","v":"横辺：b"},"高さ：H","影響円：D","α","α'","ｈ1","A2-1","A2-2","2×A2-1","4×A2-2","面積A2"]
[null,null,null,null,null,null,null,null,null,null,null,null,{"$f":"O26","v":2.2999999999999998},{"$f":"P26","v":2.2999999999999998},{"$f":"V26","v":2.59},{"$f":"W26","v":1.4531912770642861},{"$f":"ACOS(N32/P32)","v":{"$error":"#NUM!"}},{"$f":"PI()/2-Q32","v":{"$error":"#NUM!"}},{"$f":"N32/2*TAN(Q32)","v":{"$error":"#NUM!"}},{"$f":"1/2*S32*N32","v":{"$error":"#NUM!"}},{"$f":"R32*P32^2/8","v":{"$error":"#NUM!"}},{"$f":"2*T32","v":{"$error":"#NUM!"}},{"$f":"4*U32","v":{"$error":"#NUM!"}},{"$f":"R26-(V32+W32)","v":{"$error":"#NUM!"}},null,null,null,null,null,null,{"$f":"AG26","v":2.2999999999999998},{"$f":"AH26","v":2.2999999999999998},{"$f":"AN26","v":2.59},{"$f":"AO26","v":1.4531912770642861},{"$f":"ACOS(AE32/AH32)","v":{"$error":"#NUM!"}},{"$f":"PI()/2-AI32","v":{"$error":"#NUM!"}},{"$f":"AE32/2*TAN(AI32)","v":{"$error":"#NUM!"}},{"$f":"1/2*AK32*AE32","v":{"$error":"#NUM!"}},{"$f":"AJ32*AH32^2/8","v":{"$error":"#NUM!"}},{"$f":"2*AL32","v":{"$error":"#NUM!"}},{"$f":"4*AM32","v":{"$error":"#NUM!"}},{"$f":"AJ26-(AN32+AO32)","v":{"$error":"#NUM!"}}]
[null,null,null,null,null,null,null,null,null,null,null,null,{"$f":"U21","v":"STEP-3：対角が接するまで"},null,null,null,null,null,null,null,null,null,null,null,null,null,null,null,null,null,{"$f":"AM21","v":"STEP-3：対角が接するまで"}]
[null,null,null,null,null,null,null,null,null,null,null,null,"√(a2+b2）",{"$f":"O25","v":"縦辺：a"},{"$f":"P25","v":"横辺：b"},"高さ：H","影響円：D","α","β","γ","ｈ1","ｈ2","A3-1","A3-2","A3-3","2×A3-1","2×A3-2","4×A3-3","面積A3",null,"√(a2+b2）",{"$f":"AG25","v":"縦辺：a"},{"$f":"AH25","v":"横辺：b"},"高さ：H","影響円：D","α","β","γ","ｈ1","ｈ2","A3-1","A3-2","A3-3","2×A3-1","2×A3-2","4×A3-3","面積A3"]
[null,null,null,null,null,null,null,null,null,null,null,null,{"$f":"SQRT(N35^2+O35^2)","v":3.2526911934581184},{"$f":"D48","v":2.2999999999999998},{"$f":"E48","v":2.2999999999999998},{"$f":"D67","v":0},{"$f":"W26","v":1.4531912770642861},{"$f":"ACOS(O35/Q35)","v":{"$error":"#NUM!"}},{"$f":"ACOS(N35/Q35)","v":{"$error":"#NUM!"}},{"$f":"PI()/2-R35-S35","v":{"$error":"#NUM!"}},{"$f":"O35/2*TAN(R35)","v":{"$error":"#NUM!"}},{"$f":"N35/2*TAN(S35)","v":{"$error":"#NUM!"}},{"$f":"O35*U35/2","v":{"$error":"#NUM!"}},{"$f":"V35*N35/2","v":{"$error":"#NUM!"}},{"$f":"T35*Q35^2/8","v":{"$error":"#NUM!"}},{"$f":"W35*2","v":{"$error":"#NUM!"}},{"$f":"X35*2","v":{"$error":"#NUM!"}},{"$f":"4*Y35","v":{"$error":"#NUM!"}},{"$f":"G48-Z35-AA35-AB35","v":{"$error":"#NUM!"}},null,{"$f":"SQRT(AF35^2+AG35^2)","v":3.2526911934581184},{"$f":"AG26","v":2.2999999999999998},{"$f":"AH26","v":2.2999999999999998},{"$f":"AN26","v":2.59},{"$f":"AO26","v":1.4531912770642861},{"$f":"ACOS(AG35/AI35)","v":{"$error":"#NUM!"}},{"$f":"ACOS(AF35/AI35)","v":{"$error":"#NUM!"}},{"$f":"PI()/2-AJ35-AK35","v":{"$error":"#NUM!"}},{"$f":"AG35/2*TAN(AJ35)","v":{"$error":"#NUM!"}},{"$f":"AF35/2*TAN(AK35)","v":{"$error":"#NUM!"}},{"$f":"AG35*AM35/2","v":{"$error":"#NUM!"}},{"$f":"AN35*AF35/2","v":{"$error":"#NUM!"}},{"$f":"AL35*AI35^2/8","v":{"$error":"#NUM!"}},{"$f":"AO35*2","v":{"$error":"#NUM!"}},{"$f":"AP35*2","v":{"$error":"#NUM!"}},{"$f":"4*AQ35","v":{"$error":"#NUM!"}},{"$f":"AJ26-AR35-AS35-AT35","v":{"$error":"#NUM!"}}]
[]
[]
[]
[]
[]
[]
[]
[]
[]
[{"$f":"U5","v":"STEP-0：底面積（d=D）"}]
[]
[null,"項目","杭径：ｄ","長辺：a","短辺：b","面積","面積：ab","改良率"]
[null,"数値",{"$f":"F3","v":1},{"$f":"F4","v":2.2999999999999998},{"$f":"F5","v":2.2999999999999998},{"$f":"PI()*C48^2/4","v":0.78539816339744828},{"$f":"D48*E48","v":5.2899999999999991},{"$f":"(F48/G48)","v":0.14846846188987683}]
[]
[null,{"$f":"A45","v":"STEP-0：底面積（d=D）"}]
[]
[]
[]
[]
[]
[]
[]
[]
[]
[]
[]
[]
[]
[]
[]
[null,"塑性角：θ","ラジアン","高さ：H","影響円：D","面積A0"]
[null,{"$f":"F13","v":85},{"$f":"RADIANS(B67)","v":1.4835298641951802},{"$f":"E17","v":0},{"$f":"$C$48+2*D67/TAN($C$67)","v":1},{"$f":"G48-F48","v":4.5046018366025509}]
[]
[]
[]
[]
[]
[]
[]
[]
[]
[]
[]
[]
[]
[]
[]
[]
[]
[]
[]
[]
[{"$f":"U6","v":"STEP-1：影響円D範囲(d≦D<b）"}]
[]
[null,{"$f":"E47","v":"短辺：b"},"高さ：H","影響円：D"]
[null,{"$f":"E48","v":2.2999999999999998},{"$f":"E18","v":7.4295339967948753},{"$f":"$C$48+2*C91/TAN($C$67)","v":2.2999999999999998}]
[]
[null,{"$f":"A88","v":"STEP-1：影響円D範囲(d≦D<b）"}]
[]
[]
[]
[]
[]
[]
[]
[]
[]
[]
[]
[]
[]
[]
[]
[null,"4×A1-1","面積A1"]
[null,{"$f":"PI()*D91^2/4","v":4.1547562843725006},{"$f":"G48-B110","v":1.1352437156274986}]
[]
[]
[]
[]
[]
[]
[]
[]
[]
[]
[]
[]
[]
[]
[]
[]
[]
[]
[]
[]
[{"$f":"U7","v":"STEP-2：影響円D範囲(b≦D<a）"}]
[null,"上限値"]
[null,{"$f":"D47","v":"長辺：a"},{"$f":"E47","v":"短辺：b"},"高さ：H","影響円：D","α","α'"]
[null,{"$f":"D48","v":2.2999999999999998},{"$f":"E48","v":2.2999999999999998},{"$f":"E19","v":7.4301054994100149},{"$f":"$C$48+2*D134/TAN($C$67)","v":2.3001},{"$f":"ACOS(C134/E134)","v":9.3248791551174826E-3},{"$f":"PI()/2-F134","v":1.5614714476397791}]
[]
[null,{"$f":"A131","v":"STEP-2：影響円D範囲(b≦D<a）"}]
[]
[]
[]
[]
[]
[]
[]
[]
[]
[]
[]
[]
[]
[]
[]
[null,"ｈ1","A2-1","A2-2","2×A2-1","4×A2-2","面積A2"]
[null,{"$f":"C134/2*TAN(F134)","v":1.0723921857239813E-2},{"$f":"1/2*B153*C134","v":1.2332510135825784E-2},{"$f":"G134*E134^2/8","v":1.0326127813118826},{"$f":"2*C153","v":2.4665020271651569E-2},{"$f":"4*D153","v":4.1304511252475304},{"$f":"G48-(E153+F153)","v":1.1348838544808171}]
[]
[]
[]
[]
[]
[]
[]
[]
[]
[]
[]
[]
[]
[]
[]
[]
[]
[]
[]
[]
[{"$f":"U8","v":"STEP-3：影響円D範囲(a≦D<√(a^2+b^2））"}]
[null,"上限値"]
[null,"√(a2+b2）","長辺：a","短辺：ｂ","高さ：H","影響円：D","α","β","γ"]
[null,{"$f":"SQRT(C177^2+D177^2)","v":3.2526911934581184},{"$f":"O26","v":2.2999999999999998},{"$f":"P26","v":2.2999999999999998},{"$f":"E20","v":12.874189081598088},{"$f":"$C$48+2*E177/TAN($C$67)","v":3.2526911934581184},{"$f":"ACOS(D177/F177)","v":0.78539816339744828},{"$f":"ACOS(C177/F177)","v":0.78539816339744828},{"$f":"PI()/2-G177-H177","v":0}]
[]
[null,{"$f":"A174","v":"STEP-3：影響円D範囲(a≦D<√(a^2+b^2））"}]
[]
[]
[]
[]
[]
[]
[]
[]
[]
[]
[]
[]
[]
[]
[]
[null,"ｈ1","ｈ2","A3-1","A3-2","A3-3","2×A3-1","2×A3-2","4×A3-3","面積A3"]
[null,{"$f":"D177/2*TAN(G177)","v":1.1499999999999997},{"$f":"C177/2*TAN(H177)","v":1.1499999999999997},{"$f":"D177*B196/2","v":1.3224999999999996},{"$f":"C196*C177/2","v":1.3224999999999996},{"$f":"I177*F177^2/8","v":0},{"$f":"D196*2","v":2.6449999999999991},{"$f":"E196*2","v":2.6449999999999991},{"$f":"4*F196","v":0},{"$f":"R26-G196-H196-I196","v":8.8817841970012523E-16}]
[]
[]
[]
[]
[]
[]
[]
[]
[]
[]
[]
[]
[]
[]
[]
[]
[]
[]
[]
[null,null,null,null,null,null,null,null,null,null,"＊"]

{"sheet":"二軸四角配置","index":5,"n_rows":259,"n_cols":65,"rows_kept":259,"cut":false,"hidden":false,"merged":[[11,2,11,3],[9,2,9,3],[10,2,10,3],[12,1,13,1],[15,6,15,9],[12,4,13,4],[12,5,13,5],[12,6,13,6],[1,1,1,3],[2,1,7,1],[2,2,2,3],[2,7,2,9],[3,2,4,3],[3,7,3,9],[4,7,4,9],[5,7,5,9],[7,2,7,3]]}
["盛土体積 計算条件",null,null,null,null,null,null,null,null,null,null,"☆","⇦検討条件参照先"]
[null,"項　　　目",null,null,"記号","値","単位","備考",null,null,null,null,null,null,null,null,null,"ー積分計算に使用する部分ー"]
[null,"セメント\nコラム\n改良体","改良体直径",null,"ｄ",{"$f":"INDIRECT(\"'\"&$L$1&\"'!\"&L3)","v":1},"m",null,null,null,null,"F4","改良体直径はd＝0.6～1.3m",null,null,null,null,null,null,{"$f":"VLOOKUP(\"〇\",U12:W14,3,FALSE)","v":3}]
[null,null,"改良体間隔\n (改良体中心間隔)",null,"a",{"$f":"INDIRECT(\"'\"&$L$1&\"'!\"&L4)","v":2.2999999999999998},"〃",null,null,null,null,"F5","改良体間隔はλ＝1.0～2.5m",null,null,null,null,"影響円直径D","その時の高さ","面積","面積計算STEP",null,null,null,"影響円の範囲"]
[null,null,null,null,"b",{"$f":"INDIRECT(\"'\"&$L$1&\"'!\"&L5)","v":2.2999999999999998},"〃",null,null,null,null,"F6","改良率はap＝10%以上",null,null,null,null,null,null,{"$f":"T18","v":6.0192036732051024},{"$f":"U18","v":"STEP-0：底面積（d=D）"}]
[null,null,"分担面　横：L",null,"L",{"$f":"INDIRECT(\"'\"&$L$1&\"'!\"&L6)","v":""},"〃",null,null,null,null,"F7",null,null,null,null,1,{"$f":"SMALL($M$18:$M$22,Q6)","v":1},{"$f":"SMALL($N$18:$N$22,Q6)","v":0},{"$f":"VLOOKUP(R7,$M$19:$R$22,T3,FALSE)","v":4.6028885753270696},{"$f":"X6&Y6&Z6&AA6&\"）\"","v":"STEP-1：影響円D範囲(d≦D<b）"},null,null,"STEP-1：影響円D範囲(",{"$f":"R18","v":"d"},"≦D<",{"$f":"VLOOKUP(R7,$M$19:$R$22,6,FALSE)","v":"b"}]
[null,null,"分担面　縦：h",null,"h",{"$f":"INDIRECT(\"'\"&$L$1&\"'!\"&L7)","v":0},"〃",null,null,null,null,"F8",null,null,null,null,2,{"$f":"SMALL($M$18:$M$22,Q7)","v":2.2999999999999998},{"$f":"SMALL($N$18:$N$22,Q7)","v":7.4295339967948753},{"$f":"VLOOKUP(R8,$M$19:$R$22,T3,FALSE)","v":{"$error":"#NUM!"}},{"$f":"X7&Y7&Z7&AA7&\"）\"","v":"STEP-2：影響円D範囲(b≦D<a）"},null,null,"STEP-2：影響円D範囲(",{"$f":"AA6","v":"b"},"≦D<",{"$f":"VLOOKUP(R8,$M$19:$R$22,6,FALSE)","v":"a"}]
[null,null,"改良率",null,"ａp",{"$f":"ROUNDDOWN(T26,3)","v":{"$error":"#VALUE!"}},"-",null,null,null,null,"F13","盛土高",null,null,null,3,{"$f":"SMALL($M$18:$M$22,Q8)","v":2.3001},{"$f":"SMALL($N$18:$N$22,Q8)","v":7.4301054994100149},{"$f":"VLOOKUP(R9,$M$19:$R$22,T3,FALSE)","v":{"$error":"#NUM!"}},{"$f":"X8&Y8&Z8&AA8&\"）\"","v":"STEP-3：影響円D範囲(a≦D<k）"},null,null,"STEP-3：影響円D範囲(",{"$f":"AA7","v":"a"},"≦D<",{"$f":"VLOOKUP(R9,$M$19:$R$22,6,FALSE)","v":"k"}]
[null,null,null,null,null,null,null,null,null,null,null,null,"計画高","原地盤高",null,null,4,{"$f":"SMALL($M$18:$M$22,Q9)","v":2.5079872407968904},{"$f":"SMALL($N$18:$N$22,Q9)","v":8.6181865171026146},{"$f":"VLOOKUP(R10,$M$19:$R$22,T3,FALSE)","v":{"$error":"#NUM!"}},{"$f":"X9&Y9&Z9&AA9&\"）\"","v":"STEP-4：影響円D範囲(k≦D≦max）"},null,null,"STEP-4：影響円D範囲(",{"$f":"AA8","v":"k"},"≦D≦",{"$f":"R22","v":"max"}]
[null,null,null,null,null,null,null,null,null,null,null,null,{"$f":"INDIRECT(\"'\"&$L$1&\"'!\"&O10)","v":2.59},{"$f":"INDIRECT(\"'\"&$L$1&\"'!\"&P10)","v":0},"L12","M12",5,{"$f":"SMALL($M$18:$M$22,Q10)","v":3.2526911934581184},{"$f":"SMALL($N$18:$N$22,Q10)","v":12.874189081598088},0,"計算範囲外",null,null,null,{"$f":"AA9","v":"max"}]
[]
[null,"盛土条件","盛土高さ",null,"Ｈe",{"$f":"INDIRECT(\"'\"&$L$1&\"'!\"&L8)","v":2.59},"m",{"$f":"+IF(AND(M10=\"\",N10=\"\"),\"\",\"ＦH＝\"&FIXED(M10,2)&\"m，ＧL＝\"&FIXED(N10,2)&\"m\")","v":"ＦH＝2.59m，ＧL＝0.00m"},null,null,null,"F15","D15",null,null,null,null,null,null,"Case1",{"$f":"IF(P26>=Q26,\"〇\",\"-\")","v":"〇"},"b≦a",3]
[null,"塑性角","改良形式：",{"$f":"INDIRECT(\"'\"&$L$1&\"'!\"&M12)","v":"浮き型"},"θ",{"$f":"INDIRECT(\"'\"&$L$1&\"'!\"&L12)","v":85},"度",null,null,null,null,null,"D16",null,null,null,null,null,null,"Case2",{"$f":"IF(AND(P26<Q26,Y26>=Q26),\"〇\",\"-\")","v":"-"},"a<b≦k",4]
[null,null,"補助工法：",{"$f":"INDIRECT(\"'\"&$L$1&\"'!\"&M13)","v":"浅層改良"},null,{"$f":"INDIRECT(\"'\"&$L$1&\"'!\"&M13)","v":"浅層改良"},null,null,null,null,null,null,null,null,null,null,null,null,null,"Case3",{"$f":"IF(Y26<Q26,\"〇\",\"-\")","v":"-"},"k<b",5]
[null,null,null,null,null,null,null,null,null,null,null,null,"Case1：b≦aの場合",null,3,4,5,null,null,null,null,null,null,null,null,null,null,null,null,null,"Case2：a<b≦kの場合",null,null,null,null,null,null,null,null,null,null,null,null,null,null,null,null,null,"Case3：k<bの場合"]
[null,"影響円D","影響円直径D","その時の高さ","高さ:計算例","面積:計算例","概要",null,null,null,null,null,"影響円直径D","その時の高さ","面積",null,null,"影響円D",null,null,null,null,null,null,null,null,null,null,null,null,"影響円直径D","その時の高さ","面積",null,null,"影響円D",null,null,null,null,null,null,null,null,null,null,null,null,"影響円直径D","その時の高さ","面積","影響円D"]
[null,{"$f":"Y6","v":"d"},{"$f":"R6","v":1},0,1.2,{"$f":"J67","v":6.0192036732051024},"STEP0 …底面積A0",null,null,null,null,null,null,null,"case1","Case2","Case3"]
[null,{"$f":"Y7","v":"b"},2.2999999999999998,7.4295339967948753,{"$f":"D18","v":7.4295339967948753},{"$f":"G110","v":1.2099152609446735},"STEP1 …底面積A1",null,null,null,null,null,{"$f":"N26","v":1},{"$f":"(M18-N26)/2*TAN(V26)","v":0},{"$f":"AC26","v":6.0192036732051024},{"$f":"AU26","v":6.0192036732051024},{"$f":"BM26","v":6.0192036732051024},"d",null,{"$f":"O18","v":6.0192036732051024},"STEP-0：底面積（d=D）",null,null,null,null,null,null,null,null,null,{"$f":"AF26","v":1},{"$f":"(AE18-AF26)/2*TAN(AN26)","v":0},{"$f":"AU26","v":6.0192036732051024},null,null,"d",null,null,"STEP-0：底面積",null,null,null,null,null,null,null,null,null,{"$f":"AX26","v":1},{"$f":"(AW18-AX26)/2*TAN(BF26)","v":0},{"$f":"BM26","v":6.0192036732051024},"d",null,null,"STEP-0：底面積"]
[null,{"$f":"Y8","v":"a"},2.3001,7.4301054994100149,{"$f":"K19","v":0},{"$f":"I155","v":{"$error":"#NUM!"}},"STEP2…底面積A2",null,null,null,null,null,{"$f":"Q26","v":2.2999999999999998},{"$f":"(M19-N26)/2*TAN(V26)","v":7.4295339967948753},{"$f":"Z29","v":4.6028885753270696},{"$f":"AT34","v":{"$error":"#NUM!"}},{"$f":"BL39","v":{"$error":"#NUM!"}},"b",{"$f":"N18","v":0},{"$f":"O20","v":{"$error":"#NUM!"}},"STEP-1影響円Dの範囲（d≦D≦b）左右が接するまで",null,null,null,null,"☆",null,null,null,null,{"$f":"AH26","v":2.2999999999999998},{"$f":"(AE19-AF26)/2*TAN(AN26)","v":7.4295339967948753},{"$f":"AR29","v":4.6028885753270696},null,null,"a",null,null,"STEP-1影響円Dの範囲（d≦D≦a）上下が接するまで",null,null,null,null,null,null,null,null,null,{"$f":"AZ26","v":2.2999999999999998},{"$f":"(AW19-AX26)/2*TAN(BF26)","v":7.4295339967948753},{"$f":"BJ29","v":4.6028885753270696},"a",null,null,"STEP-1影響円Dの範囲（d≦D≦a）上下が接するまで"]
[null,{"$f":"Y9","v":"k"},2.5079872407968904,8.6181865171026146,{"$f":"D20","v":8.6181865171026146},{"$f":"I196","v":0.48969603823303931},"STEP3 …底面積A3",null,null,null,null,null,{"$f":"IF(P26=Q26,P26+0.0001,P26)","v":2.3001},{"$f":"(M20-N26)/2*TAN(V26)","v":7.4301054994100149},{"$f":"AB34","v":{"$error":"#NUM!"}},{"$f":"AR29","v":4.6028885753270696},{"$f":"BJ29","v":4.6028885753270696},"a",{"$f":"N20","v":7.4301054994100149},{"$f":"O21","v":{"$error":"#NUM!"}},"STEP-2影響円Dの範囲（b≦D≦a）上下が接するまで",null,null,null,null,"I26",{"$f":"INDIRECT(\"'\"&$Z$19&\"'!\"&Z20)","v":2.59},null,null,null,{"$f":"IF(AH26=AI26,AH26+0.0001,AH26)","v":2.3001},{"$f":"(AE20-AF26)/2*TAN(AN26)","v":7.4301054994100149},{"$f":"AT34","v":{"$error":"#NUM!"}},null,null,"b",null,null,"STEP-2影響円Dの範囲（a≦D≦b）左右が接するまで",null,null,null,null,null,null,null,null,null,{"$f":"SQRT((AZ26^2+AX26^2))","v":2.5079872407968904},{"$f":"(AW20-AX26)/2*TAN(BF26)","v":8.6181865171026146},{"$f":"BL34","v":{"$error":"#NUM!"}},"k=√(a2+d2）",null,null,"STEP-2影響円Dの範囲（a≦D≦bk）左右が接するまで"]
[null,{"$f":"Y10","v":"max"},3.2526911934581184,12.874189081598088,{"$f":"K21","v":0},{"$f":"G239","v":{"$error":"#NUM!"}},"STEP4 …底面積A4",null,null,null,null,null,{"$f":"SQRT((P26^2+N26^2))","v":2.5079872407968904},{"$f":"(M21-N26)/2*TAN(V26)","v":8.6181865171026146},{"$f":"AB39","v":{"$error":"#NUM!"}},{"$f":"AT39","v":{"$error":"#NUM!"}},{"$f":"BL34","v":{"$error":"#NUM!"}},"k",{"$f":"N21","v":8.6181865171026146},{"$f":"O19","v":4.6028885753270696},"STEP-3影響円Dの範囲（a≦D≦k）",null,null,null,null,"採用値",null,null,null,null,{"$f":"SQRT((AH26^2+AF26^2))","v":2.5079872407968904},{"$f":"(AE21-AF26)/2*TAN(AN26)","v":8.6181865171026146},{"$f":"AT39","v":{"$error":"#NUM!"}},null,null,"k=√(a2+d2）",null,null,"STEP-3影響円Dの範囲（a≦D≦k）",null,null,null,null,null,null,null,null,null,{"$f":"BA26","v":2.2999999999999998},{"$f":"(AW21-AX26)/2*TAN(BF26)","v":7.4295339967948753},{"$f":"BL39","v":{"$error":"#NUM!"}},"b",null,null,"STEP-3影響円Dの範囲（k≦D≦b）"]
[null,null,null,null,null,null,null,null,null,null,null,null,{"$f":"SQRT((P26^2+Q26^2))","v":3.2526911934581184},{"$f":"(M22-N26)/2*TAN(V26)","v":12.874189081598088},{"$f":"AB44","v":{"$error":"#NUM!"}},{"$f":"AT44","v":{"$error":"#NUM!"}},{"$f":"BL44","v":{"$error":"#NUM!"}},"max",{"$f":"N19","v":7.4295339967948753},{"$f":"O22","v":{"$error":"#NUM!"}},"STEP-4影響円Dの範囲（k≦D≦max）対角が接するまで",null,null,null,null,"高さ","面積","step",null,null,{"$f":"SQRT((AH26^2+AI26^2))","v":3.2526911934581184},{"$f":"(AE22-AF26)/2*TAN(AN26)","v":12.874189081598088},{"$f":"AT44","v":{"$error":"#NUM!"}},null,null,"max=√(a2+b2）",null,null,"STEP-4影響円Dの範囲（k≦D≦max）対角が接するまで",null,null,null,null,null,null,null,null,null,{"$f":"SQRT((AZ26^2+BA26^2))","v":3.2526911934581184},{"$f":"(AW22-AX26)/2*TAN(BF26)","v":12.874189081598088},{"$f":"BL44","v":{"$error":"#NUM!"}},"max=√(a2+b2）",null,null,"STEP-4影響円Dの範囲（b≦D≦max）対角が接するまで"]
[null,null,null,null,null,null,null,null,null,null,null,null,null,null,null,null,null,null,{"$f":"N22","v":12.874189081598088},0,"計算範囲外",null,null,null,null,{"$f":"INDIRECT(\"'\"&$Z$19&\"'!\"&Z20)","v":2.59},{"$f":"IF(Z23=0,T5,VLOOKUP(Z23,S5:T10,2,TRUE))","v":4.6028885753270696},{"$f":"IF(Z23=0,U5,VLOOKUP(Z23,S5:U10,3,TRUE))","v":"STEP-1：影響円D範囲(d≦D<b）"},null,null,null,null,null,null,null,null,null,null,"計算範囲外",null,null,null,null,null,null,null,null,null,null,null,null,null,null,null,"計算範囲外"]
[null,null,null,null,null,null,null,null,null,null,null,null,"STEP-0：底面積",null,null,null,null,null,null,null,null,null,null,null,null,null,null,null,null,null,"STEP-0：底面積",null,null,null,null,null,null,null,null,null,null,null,null,null,null,null,null,null,"STEP-0：底面積"]
[null,null,null,null,null,null,{"$f":"U9","v":"STEP-4：影響円D範囲(k≦D≦max）"},null,null,null,null,null,"項目","杭径：ｄ","杭面積","縦辺：a","横辺：b","分担面：L","面積：aL","改良率","塑性角：θ","ラジアン","高さ：H","影響円：D","k","max","面積A0-1","面積2A0-2","面積A0",null,"項目","杭径：ｄ","杭面積","縦辺：a","横辺：b","分担面：L","面積：aL","改良率","塑性角：θ","ラジアン","高さ：H","影響円：D","k","max","面積A0-1","面積2A0-2","面積A0",null,"項目","杭径：ｄ","杭面積","縦辺：a","横辺：b","分担面：L","面積：aL","改良率","塑性角：θ","ラジアン","高さ：H","影響円：D","k","max","面積A0-1","面積2A0-2","面積A0"]
[null,null,null,null,null,null,null,null,null,null,null,null,"数値",{"$f":"$F$3","v":1},{"$f":"PI()*N26^2/4","v":0.78539816339744828},{"$f":"$F$4","v":2.2999999999999998},{"$f":"$F$5","v":2.2999999999999998},{"$f":"$F$6","v":""},{"$f":"P26*R26","v":{"$error":"#VALUE!"}},{"$f":"(O26*2/S26)","v":{"$error":"#VALUE!"}},{"$f":"$F$13","v":85},{"$f":"RADIANS(U26)","v":1.4835298641951802},{"$f":"$Z$23","v":2.59},{"$f":"N26+2*W26/TAN(V26)","v":1.4531912770642861},{"$f":"SQRT((N26^2+P26^2))","v":2.5079872407968904},{"$f":"SQRT((P26^2+Q26^2))","v":3.2526911934581184},{"$f":"P26*Q26-O26","v":4.5046018366025509},{"$f":"N26*P26-O26","v":1.5146018366025515},{"$f":"AA26+AB26","v":6.0192036732051024},null,"数値",{"$f":"$F$3","v":1},{"$f":"PI()*AF26^2/4","v":0.78539816339744828},{"$f":"$F$4","v":2.2999999999999998},{"$f":"$F$5","v":2.2999999999999998},{"$f":"$F$6","v":""},{"$f":"AH26*AJ26","v":{"$error":"#VALUE!"}},{"$f":"(AG26*2/AK26)","v":{"$error":"#VALUE!"}},{"$f":"$F$13","v":85},{"$f":"RADIANS(AM26)","v":1.4835298641951802},{"$f":"$Z$23","v":2.59},{"$f":"AF26+2*AO26/TAN(AN26)","v":1.4531912770642861},{"$f":"SQRT((AF26^2+AH26^2))","v":2.5079872407968904},{"$f":"SQRT((AH26^2+AI26^2))","v":3.2526911934581184},{"$f":"AH26*AI26-AG26","v":4.5046018366025509},{"$f":"AF26*AH26-AG26","v":1.5146018366025515},{"$f":"AS26+AT26","v":6.0192036732051024},null,"数値",{"$f":"$F$3","v":1},{"$f":"PI()*AX26^2/4","v":0.78539816339744828},{"$f":"$F$4","v":2.2999999999999998},{"$f":"$F$5","v":2.2999999999999998},{"$f":"$F$6","v":""},{"$f":"AZ26*BB26","v":{"$error":"#VALUE!"}},{"$f":"(AY26*2/BC26)","v":{"$error":"#VALUE!"}},{"$f":"$F$13","v":85},{"$f":"RADIANS(BE26)","v":1.4835298641951802},{"$f":"$Z$23","v":2.59},{"$f":"AX26+2*BG26/TAN(BF26)","v":1.4531912770642861},{"$f":"SQRT((AX26^2+AZ26^2))","v":2.5079872407968904},{"$f":"SQRT((AZ26^2+BA26^2))","v":3.2526911934581184},{"$f":"AZ26*BA26-AY26","v":4.5046018366025509},{"$f":"AX26*AZ26-AY26","v":1.5146018366025515},{"$f":"BK26+BL26","v":6.0192036732051024}]
[null,null,null,null,null,null,{"$f":"U8","v":"STEP-3：影響円D範囲(a≦D<k）"},null,null,null,null,null,{"$f":"U19","v":"STEP-1影響円Dの範囲（d≦D≦b）左右が接するまで"},null,null,null,null,null,null,null,null,null,null,null,null,null,null,null,null,null,{"$f":"AM19","v":"STEP-1影響円Dの範囲（d≦D≦a）上下が接するまで"},null,null,null,null,null,null,null,null,null,null,null,null,null,null,null,null,null,{"$f":"BC19","v":"STEP-1影響円Dの範囲（d≦D≦a）上下が接するまで"}]
[null,null,null,null,null,null,null,null,null,null,null,null,"杭径：ｄ",{"$f":"P25","v":"縦辺：a"},{"$f":"Q25","v":"横辺：b"},"高さ：H","影響円：D","角度:δ121","角度:δ122","高さ:h12","面積:A121","面積:A122","A1-1","A1-2","2×A1-2","面積A1",null,null,null,null,"杭径：ｄ",{"$f":"AH25","v":"縦辺：a"},{"$f":"AI25","v":"横辺：b"},"高さ：H","影響円：D","角度:δ121","角度:δ122","高さ:h12","面積:A121","面積:A122","A1-1","A1-2","2×A1-2","面積A1",null,null,null,null,"杭径：ｄ",{"$f":"AZ25","v":"縦辺：a"},{"$f":"BA25","v":"横辺：b"},"高さ：H","影響円：D","角度:δ121","角度:δ122","高さ:h12","面積:A121","面積:A122","A1-1","A1-2","2×A1-2","面積A1"]
[null,null,null,null,null,null,{"$f":"U7","v":"STEP-2：影響円D範囲(b≦D<a）"},null,null,null,null,null,{"$f":"N26","v":1},{"$f":"P26","v":2.2999999999999998},{"$f":"Q26","v":2.2999999999999998},{"$f":"W26","v":2.59},{"$f":"X26","v":1.4531912770642861},{"$f":"ACOS(M29/Q29)","v":0.81187296904977169},{"$f":"PI()/2-R29","v":0.75892335774512487},{"$f":"M29/2*TAN(R29)","v":0.52720131063373943},{"$f":"M29*T29/4","v":0.13180032765843486},{"$f":"S29*Q29^2/8","v":0.20033346242108219},{"$f":"N29*O29-PI()*Q29^2/4","v":3.6314237356451375},{"$f":"N29*M29/2-2*(U29+V29)","v":0.48573241984096582},{"$f":"X29*2","v":0.97146483968193165},{"$f":"W29+Y29","v":4.6028885753270696},null,null,null,null,{"$f":"AF26","v":1},{"$f":"AH26","v":2.2999999999999998},{"$f":"AI26","v":2.2999999999999998},{"$f":"AO26","v":2.59},{"$f":"AP26","v":1.4531912770642861},{"$f":"ACOS(AE29/AI29)","v":0.81187296904977169},{"$f":"PI()/2-AJ29","v":0.75892335774512487},{"$f":"AE29/2*TAN(AJ29)","v":0.52720131063373943},{"$f":"AE29*AL29/4","v":0.13180032765843486},{"$f":"AK29*AI29^2/8","v":0.20033346242108219},{"$f":"AF29*AG29-PI()*AI29^2/4","v":3.6314237356451375},{"$f":"MIN(AF29:AG29)*AE29/2-2*(AM29+AN29)","v":0.48573241984096582},{"$f":"AP29*2","v":0.97146483968193165},{"$f":"AO29+AQ29","v":4.6028885753270696},null,null,null,null,{"$f":"AX26","v":1},{"$f":"AZ26","v":2.2999999999999998},{"$f":"BA26","v":2.2999999999999998},{"$f":"BG26","v":2.59},{"$f":"BH26","v":1.4531912770642861},{"$f":"ACOS(AW29/BA29)","v":0.81187296904977169},{"$f":"PI()/2-BB29","v":0.75892335774512487},{"$f":"AW29/2*TAN(BB29)","v":0.52720131063373943},{"$f":"AW29*BD29/4","v":0.13180032765843486},{"$f":"BC29*BA29^2/8","v":0.20033346242108219},{"$f":"AX29*AY29-PI()*BA29^2/4","v":3.6314237356451375},{"$f":"MIN(AX29:AY29)*AW29/2-2*(BE29+BF29)","v":0.48573241984096582},{"$f":"BH29*2","v":0.97146483968193165},{"$f":"BG29+BI29","v":4.6028885753270696}]
[null,null,null,null,null,null,null,null,null,null,null,null,{"$f":"U20","v":"STEP-2影響円Dの範囲（b≦D≦a）上下が接するまで"},null,null,null,null,null,null,null,null,null,null,null,null,null,null,null,null,null,{"$f":"AM20","v":"STEP-2影響円Dの範囲（a≦D≦b）左右が接するまで"},null,null,null,null,null,null,null,null,null,null,null,null,null,null,null,null,null,{"$f":"BC20","v":"STEP-2影響円Dの範囲（a≦D≦bk）左右が接するまで"}]
[null,null,null,null,null,null,{"$f":"U6","v":"STEP-1：影響円D範囲(d≦D<b）"},null,null,null,null,null,"杭径：ｄ",{"$f":"P25","v":"縦辺：a"},{"$f":"Q25","v":"横辺：b"},"高さ：H","影響円：D","角度:δ211","角度:δ212",null,"高さ:h211",null,"面積:A211","面積:A212",null,"A2-1",null,null,null,null,"杭径：ｄ",{"$f":"AH25","v":"縦辺：a"},{"$f":"AI25","v":"横辺：b"},"高さ：H","影響円：D","角度:δ211","角度:δ212","角度:δ113","高さ:h211",null,"面積:A211","面積:A212",null,"A2-1",null,null,null,null,"杭径：ｄ",{"$f":"AZ25","v":"縦辺：a"},{"$f":"BA25","v":"横辺：b"},"高さ：H","影響円：D","角度:δ211","角度:δ212","角度:δ113","高さ:h211",null,"面積:A211","面積:A212",null,"A2-1"]
[null,null,null,null,null,null,null,null,null,null,null,null,{"$f":"N26","v":1},{"$f":"P26","v":2.2999999999999998},{"$f":"Q26","v":2.2999999999999998},{"$f":"W26","v":2.59},{"$f":"X26","v":1.4531912770642861},{"$f":"ACOS(O32/Q32)","v":{"$error":"#NUM!"}},{"$f":"PI()/2-R32","v":{"$error":"#NUM!"}},null,{"$f":"O32/2*TAN(R32)","v":{"$error":"#NUM!"}},null,{"$f":"1/4*U32*O32","v":{"$error":"#NUM!"}},{"$f":"S32*Q32^2/8","v":{"$error":"#NUM!"}},null,{"$f":"O32*N32-4*(W32+X32)","v":{"$error":"#NUM!"}},null,null,null,null,{"$f":"AF26","v":1},{"$f":"AH26","v":2.2999999999999998},{"$f":"AI26","v":2.2999999999999998},{"$f":"AO26","v":2.59},{"$f":"AP26","v":1.4531912770642861},{"$f":"ACOS(MIN(AF32:AG32)/AI32)","v":{"$error":"#NUM!"}},{"$f":"PI()/2-AJ32","v":{"$error":"#NUM!"}},null,{"$f":"MIN(AF32:AG32)/2*TAN(AJ32)","v":{"$error":"#NUM!"}},null,{"$f":"1/4*AM32*MIN(AF32:AG32)","v":{"$error":"#NUM!"}},{"$f":"AK32*AI32^2/8","v":{"$error":"#NUM!"}},null,{"$f":"AG32*AF32-4*(AO32+AP32)","v":{"$error":"#NUM!"}},null,null,null,null,{"$f":"AX26","v":1},{"$f":"AZ26","v":2.2999999999999998},{"$f":"BA26","v":2.2999999999999998},{"$f":"BG26","v":2.59},{"$f":"BH26","v":1.4531912770642861},{"$f":"ACOS(MIN(AX32:AY32)/BA32)","v":{"$error":"#NUM!"}},{"$f":"PI()/2-BB32","v":{"$error":"#NUM!"}},null,{"$f":"MIN(AX32:AY32)/2*TAN(BB32)","v":{"$error":"#NUM!"}},null,{"$f":"1/4*BE32*MIN(AX32:AY32)","v":{"$error":"#NUM!"}},{"$f":"BC32*BA32^2/8","v":{"$error":"#NUM!"}},null,{"$f":"AY32*AX32-4*(BG32+BH32)","v":{"$error":"#NUM!"}}]
[null,null,null,null,null,null,{"$f":"U5","v":"STEP-0：底面積（d=D）"},null,null,null,null,null,null,null,null,null,null,"角度:δ221","角度:δ222",null,"高さ:h221","高さ:h222","面積:A221","面積:A222",null,"A2-2","2×A2-2","面積A2",null,null,null,null,null,null,null,"角度:δ221","角度:δ222","角度:δ223","高さ:h221","高さ:h222","面積:A221","面積:A222","面積:A223","A2-2","2×A2-2","面積A2",null,null,null,null,null,null,null,"角度:δ221","角度:δ222","角度:δ223","高さ:h221","高さ:h222","面積:A221","面積:A222","面積:A223","A2-2","2×A2-2","面積A2"]
[null,null,null,null,null,null,null,null,null,null,null,null,null,null,null,null,null,{"$f":"ACOS(M32/Q32)","v":0.81187296904977169},{"$f":"PI()/2-R34","v":0.75892335774512487},null,{"$f":"M32/2*TAN(R34)","v":0.52720131063373943},{"$f":"N32/2*TAN(S34)","v":1.0906649668772683},{"$f":"M32*U34/4","v":0.13180032765843486},{"$f":"S34*Q32^2/8","v":0.20033346242108219},null,{"$f":"N32*M32/2-2*(W34+X34)","v":0.48573241984096582},{"$f":"Z34*2","v":0.97146483968193165},{"$f":"Z32+AA34","v":{"$error":"#NUM!"}},null,null,null,null,null,null,null,{"$f":"ACOS(AE32/AI32)","v":0.81187296904977169},{"$f":"ACOS(AF32/AI32)","v":{"$error":"#NUM!"}},{"$f":"PI()/2-AJ34-AK34","v":{"$error":"#NUM!"}},{"$f":"AE32/2*TAN(AJ34)","v":0.52720131063373943},{"$f":"AF32/2*TAN(AK34)","v":{"$error":"#NUM!"}},{"$f":"AE32*AM34/4","v":0.13180032765843486},{"$f":"AF32*AN34/4","v":{"$error":"#NUM!"}},{"$f":"AL34*AI32^2/8","v":{"$error":"#NUM!"}},{"$f":"AF32*AE32/2-2*(AO34+AP34+AQ34)","v":{"$error":"#NUM!"}},{"$f":"AR34*2","v":{"$error":"#NUM!"}},{"$f":"AR32+AS34","v":{"$error":"#NUM!"}},null,null,null,null,null,null,null,{"$f":"ACOS(AW32/BA32)","v":0.81187296904977169},{"$f":"ACOS(AX32/BA32)","v":{"$error":"#NUM!"}},{"$f":"PI()/2-BB34-BC34","v":{"$error":"#NUM!"}},{"$f":"AW32/2*TAN(BB34)","v":0.52720131063373943},{"$f":"AX32/2*TAN(BC34)","v":{"$error":"#NUM!"}},{"$f":"AW32*BE34/4","v":0.13180032765843486},{"$f":"AX32*BF34/4","v":{"$error":"#NUM!"}},{"$f":"BD34*BA32^2/8","v":{"$error":"#NUM!"}},{"$f":"AX32*AW32/2-2*(BG34+BH34+BI34)","v":{"$error":"#NUM!"}},{"$f":"BJ34*2","v":{"$error":"#NUM!"}},{"$f":"BJ32+BK34","v":{"$error":"#NUM!"}}]
[null,null,null,null,null,null,null,null,null,null,null,null,{"$f":"U21","v":"STEP-3影響円Dの範囲（a≦D≦k）"},null,null,null,null,null,null,null,null,null,null,null,null,null,null,null,null,null,{"$f":"AM21","v":"STEP-3影響円Dの範囲（a≦D≦k）"},null,null,null,null,null,null,null,null,null,null,null,null,null,null,null,null,null,{"$f":"BC21","v":"STEP-3影響円Dの範囲（k≦D≦b）"}]
[null,null,null,null,null,null,null,null,null,null,null,null,"杭径：ｄ",{"$f":"P25","v":"縦辺：a"},{"$f":"Q25","v":"横辺：b"},"高さ：H","影響円：D","角度:δ311","角度:δ312","角度:δ313","ｈ311","ｈ312","A311","A312","A313","A3-1",null,null,null,null,"杭径：ｄ",{"$f":"AH25","v":"縦辺：a"},{"$f":"AI25","v":"横辺：b"},"高さ：H","影響円：D","角度:δ311","角度:δ312","角度:δ313","ｈ311","ｈ312","A311","A312","A313","A3-1",null,null,null,null,"杭径：ｄ",{"$f":"AZ25","v":"縦辺：a"},{"$f":"BA25","v":"横辺：b"},"高さ：H","影響円：D","角度:δ211","角度:δ212",null,"ｈ211","ｈ212","A211","A212","A213","A2-1"]
[null,null,null,null,null,null,null,null,null,null,null,null,{"$f":"N26","v":1},{"$f":"P26","v":2.2999999999999998},{"$f":"Q26","v":2.2999999999999998},{"$f":"W26","v":2.59},{"$f":"X26","v":1.4531912770642861},{"$f":"ACOS(O37/Q37)","v":{"$error":"#NUM!"}},{"$f":"ACOS(N37/Q37)","v":{"$error":"#NUM!"}},{"$f":"PI()/2-R37-S37","v":{"$error":"#NUM!"}},{"$f":"O37/2*TAN(R37)","v":{"$error":"#NUM!"}},{"$f":"N37/2*TAN(S37)","v":{"$error":"#NUM!"}},{"$f":"U37*O37/4","v":{"$error":"#NUM!"}},{"$f":"V37*N37/4","v":{"$error":"#NUM!"}},{"$f":"T37*Q37^2/8","v":{"$error":"#NUM!"}},{"$f":"N37*O37-4*(W37+X37+Y37)","v":{"$error":"#NUM!"}},null,null,null,null,{"$f":"AF26","v":1},{"$f":"AH26","v":2.2999999999999998},{"$f":"AI26","v":2.2999999999999998},{"$f":"AO26","v":2.59},{"$f":"AP26","v":1.4531912770642861},{"$f":"ACOS(AG37/AI37)","v":{"$error":"#NUM!"}},{"$f":"ACOS(AF37/AI37)","v":{"$error":"#NUM!"}},{"$f":"PI()/2-AJ37-AK37","v":{"$error":"#NUM!"}},{"$f":"AG37/2*TAN(AJ37)","v":{"$error":"#NUM!"}},{"$f":"AF37/2*TAN(AK37)","v":{"$error":"#NUM!"}},{"$f":"AM37*AG37/4","v":{"$error":"#NUM!"}},{"$f":"AN37*AF37/4","v":{"$error":"#NUM!"}},{"$f":"AL37*AI37^2/8","v":{"$error":"#NUM!"}},{"$f":"AF37*AG37-4*(AO37+AP37+AQ37)","v":{"$error":"#NUM!"}},null,null,null,null,{"$f":"AX26","v":1},{"$f":"AZ26","v":2.2999999999999998},{"$f":"BA26","v":2.2999999999999998},{"$f":"BG26","v":2.59},{"$f":"BH26","v":1.4531912770642861},{"$f":"ACOS(MIN(AX37:AY37)/BA37)","v":{"$error":"#NUM!"}},{"$f":"PI()/2-BB37","v":{"$error":"#NUM!"}},null,{"$f":"AX37/2*TAN(BB37)","v":{"$error":"#NUM!"}},null,{"$f":"BE37*AX37/4","v":{"$error":"#NUM!"}},{"$f":"BC37*BA37^2/8","v":{"$error":"#NUM!"}},null,{"$f":"AX37*AY37-4*(BG37+BH37+BI37)","v":{"$error":"#NUM!"}}]
[null,null,null,null,null,null,null,null,null,null,null,null,null,null,null,null,null,"角度:δ321","角度:δ322","角度:δ323","ｈ321","ｈ322","A321","A322","A323","A3-2","2×A3-2","面積A3",null,null,null,null,null,null,null,"角度:δ321","角度:δ322","角度:δ323","ｈ321","ｈ322","A321","A322","A323","A3-2","2×A3-2","面積A3",null,null,null,null,null,null,null,null,null,null,null,null,null,null,null,null,null,"面積A2"]
[null,null,null,null,null,null,null,null,null,null,null,null,null,null,null,null,null,{"$f":"ACOS(M37/Q37)","v":0.81187296904977169},{"$f":"S37","v":{"$error":"#NUM!"}},{"$f":"PI()/2-R39-S39","v":{"$error":"#NUM!"}},{"$f":"M37/2*TAN(R39)","v":0.52720131063373943},{"$f":"V37","v":{"$error":"#NUM!"}},{"$f":"U39*M37/4","v":0.13180032765843486},{"$f":"V39*N37/4","v":{"$error":"#NUM!"}},{"$f":"T39*Q37^2/8","v":{"$error":"#NUM!"}},{"$f":"N37/2*M37-2*(W39+X39+Y39)","v":{"$error":"#NUM!"}},{"$f":"Z39*2","v":{"$error":"#NUM!"}},{"$f":"Z37+AA39","v":{"$error":"#NUM!"}},null,null,null,null,null,null,null,{"$f":"ACOS(AE37/AI37)","v":0.81187296904977169},{"$f":"AK37","v":{"$error":"#NUM!"}},{"$f":"PI()/2-AJ39-AK39","v":{"$error":"#NUM!"}},{"$f":"AE37/2*TAN(AJ39)","v":0.52720131063373943},{"$f":"AN37","v":{"$error":"#NUM!"}},{"$f":"AM39*AE37/4","v":0.13180032765843486},{"$f":"AN39*AF37/4","v":{"$error":"#NUM!"}},{"$f":"AL39*AI37^2/8","v":{"$error":"#NUM!"}},{"$f":"AF37/2*AE37-2*(AO39+AP39+AQ39)","v":{"$error":"#NUM!"}},{"$f":"AR39*2","v":{"$error":"#NUM!"}},{"$f":"AR37+AS39","v":{"$error":"#NUM!"}},null,null,null,null,null,null,null,null,null,null,null,null,null,null,null,null,null,{"$f":"BJ37","v":{"$error":"#NUM!"}}]
[null,null,null,null,null,null,null,null,null,null,null,null,{"$f":"U22","v":"STEP-4影響円Dの範囲（k≦D≦max）対角が接するまで"},null,null,null,null,null,null,null,null,null,null,null,null,null,null,null,null,null,{"$f":"AM22","v":"STEP-4影響円Dの範囲（k≦D≦max）対角が接するまで"},null,null,null,null,null,null,null,null,null,null,null,null,null,null,null,null,null,{"$f":"BC22","v":"STEP-4影響円Dの範囲（b≦D≦max）対角が接するまで"}]
[null,null,null,null,null,null,null,null,null,null,null,null,"杭径：ｄ",{"$f":"P25","v":"縦辺：a"},{"$f":"Q25","v":"横辺：b"},"高さ：H","影響円：D","角度:δ411","角度:δ412","角度:δ413","ｈ411","ｈ412","A411","A412","A313","A4-1",null,null,null,null,"杭径：ｄ",{"$f":"AH25","v":"縦辺：a"},{"$f":"AI25","v":"横辺：b"},"高さ：H","影響円：D","角度:δ411","角度:δ412","角度:δ413","ｈ411","ｈ412","A411","A412","A313","A4-1",null,null,null,null,"杭径：ｄ",{"$f":"AZ25","v":"縦辺：a"},{"$f":"BA25","v":"横辺：b"},"高さ：H","影響円：D","角度:δ311","角度:δ312","角度:δ313","ｈ311","ｈ312","A311","A312","A313","A3-1"]
[null,null,null,null,null,null,null,null,null,null,null,null,{"$f":"N26","v":1},{"$f":"P26","v":2.2999999999999998},{"$f":"Q26","v":2.2999999999999998},{"$f":"W26","v":2.59},{"$f":"X26","v":1.4531912770642861},{"$f":"ACOS(O42/Q42)","v":{"$error":"#NUM!"}},{"$f":"ACOS(N42/Q42)","v":{"$error":"#NUM!"}},{"$f":"PI()/2-R42-S42","v":{"$error":"#NUM!"}},{"$f":"O42/2*TAN(R42)","v":{"$error":"#NUM!"}},{"$f":"N42/2*TAN(S42)","v":{"$error":"#NUM!"}},{"$f":"U42*O42/4","v":{"$error":"#NUM!"}},{"$f":"V42*N42/4","v":{"$error":"#NUM!"}},{"$f":"T42*Q42^2/8","v":{"$error":"#NUM!"}},{"$f":"N42*O42-4*(W42+X42+Y42)","v":{"$error":"#NUM!"}},null,null,null,null,{"$f":"AF26","v":1},{"$f":"AH26","v":2.2999999999999998},{"$f":"AI26","v":2.2999999999999998},{"$f":"AO26","v":2.59},{"$f":"AP26","v":1.4531912770642861},{"$f":"ACOS(AG42/AI42)","v":{"$error":"#NUM!"}},{"$f":"ACOS(AF42/AI42)","v":{"$error":"#NUM!"}},{"$f":"PI()/2-AJ42-AK42","v":{"$error":"#NUM!"}},{"$f":"AG42/2*TAN(AJ42)","v":{"$error":"#NUM!"}},{"$f":"AF42/2*TAN(AK42)","v":{"$error":"#NUM!"}},{"$f":"AM42*AG42/4","v":{"$error":"#NUM!"}},{"$f":"AN42*AF42/4","v":{"$error":"#NUM!"}},{"$f":"AL42*AI42^2/8","v":{"$error":"#NUM!"}},{"$f":"AF42*AG42-4*(AO42+AP42+AQ42)","v":{"$error":"#NUM!"}},null,null,null,null,{"$f":"AX26","v":1},{"$f":"AZ26","v":2.2999999999999998},{"$f":"BA26","v":2.2999999999999998},{"$f":"BG26","v":2.59},{"$f":"BH26","v":1.4531912770642861},{"$f":"ACOS(AY42/BA42)","v":{"$error":"#NUM!"}},{"$f":"ACOS(AX42/BA42)","v":{"$error":"#NUM!"}},{"$f":"PI()/2-BB42-BC42","v":{"$error":"#NUM!"}},{"$f":"AY42/2*TAN(BB42)","v":{"$error":"#NUM!"}},{"$f":"AX42/2*TAN(BC42)","v":{"$error":"#NUM!"}},{"$f":"AY42*BE42/4","v":{"$error":"#NUM!"}},{"$f":"BF42*AX42/4","v":{"$error":"#NUM!"}},{"$f":"BD42*BA42^2/8","v":{"$error":"#NUM!"}},{"$f":"AX42*AY42-4*(BG42+BH42+BI42)","v":{"$error":"#NUM!"}}]
[null,null,null,null,null,null,null,null,null,null,null,null,null,null,null,null,null,null,null,null,null,null,null,null,null,null,null,"面積A4",null,null,null,null,null,null,null,null,null,null,null,null,null,null,null,null,null,"面積A4",null,null,null,null,null,null,null,"角度:δ321","角度:δ322","角度:δ323","ｈ321","ｈ322","A321","A322","A323","A3-2","2×A3-2","面積A3"]
[null,null,null,null,null,null,null,null,null,null,null,null,null,null,null,null,null,null,null,null,null,null,null,null,null,null,null,{"$f":"Z42+AA44","v":{"$error":"#NUM!"}},null,null,null,null,null,null,null,null,null,null,null,null,null,null,null,null,null,{"$f":"AR42+AS44","v":{"$error":"#NUM!"}},null,null,null,null,null,null,null,null,null,null,null,null,null,null,null,null,null,{"$f":"BJ42+BK44","v":{"$error":"#NUM!"}}]
["STEP-0：底面積"]
[]
[null,"項目","杭径：ｄ","杭面積","短辺：a","長辺：b","分担面：L","面積：aL","改良率"]
[null,"数値",{"$f":"F3","v":1},{"$f":"PI()*C48^2/4","v":0.78539816339744828},{"$f":"F4","v":2.2999999999999998},{"$f":"F5","v":2.2999999999999998},{"$f":"F6","v":""},{"$f":"E48*G48","v":{"$error":"#VALUE!"}},{"$f":"(D48*2/H48)","v":{"$error":"#VALUE!"}}]
[]
[null,{"$f":"A45","v":"STEP-0：底面積"}]
[]
[]
[]
[]
[]
[]
[]
[]
[]
[]
[]
[]
[]
[]
[]
[null,"塑性角：θ","ラジアン","高さ：H","影響円：D","k","max","面積A0-1","面積2A0-2","面積A0"]
[null,{"$f":"F13","v":85},{"$f":"RADIANS(B67)","v":1.4835298641951802},{"$f":"E17","v":1.2},{"$f":"$C$48+2*D67/TAN($C$67)","v":1.2099727924622175},{"$f":"SQRT((C48^2+E48^2))","v":2.5079872407968904},{"$f":"SQRT((E48^2+F48^2))","v":3.2526911934581184},{"$f":"E48*F48-D48","v":4.5046018366025509},{"$f":"C48*E48-D48","v":1.5146018366025515},{"$f":"H67+I67","v":6.0192036732051024}]
[]
[]
[]
[]
[]
[]
[]
[]
[]
[]
[]
[]
[]
[]
[]
[]
[]
[]
[]
[]
[{"$f":"U6","v":"STEP-1：影響円D範囲(d≦D<b）"}]
[]
[null,"杭径：ｄ",{"$f":"E47","v":"短辺：a"},{"$f":"F47","v":"長辺：b"},"高さ：H","影響円：D","角度:δ121","角度:δ122","高さ:h12"]
[null,{"$f":"C48","v":1},{"$f":"E48","v":2.2999999999999998},{"$f":"F48","v":2.2999999999999998},{"$f":"E18","v":7.4295339967948753},{"$f":"$C$48+2*E91/TAN($C$67)","v":2.2999999999999998},{"$f":"ACOS(B91/F91)","v":1.1209994663705389},{"$f":"PI()/2-G91","v":0.44979686042435763},{"$f":"B91/2*TAN(G91)","v":1.0356157588603989}]
[]
[null,{"$f":"A88","v":"STEP-1：影響円D範囲(d≦D<b）"}]
[]
[]
[]
[]
[]
[]
[]
[]
[]
[]
[]
[]
[]
[]
[]
[null,"面積:A121","面積:A122","A1-1","A1-2","2×A1-2","面積A1"]
[null,{"$f":"B91*I91/4","v":0.25890393971509973},{"$f":"H91*F91^2/8","v":0.29742817395560645},{"$f":"C91*D91-PI()*F91^2/4","v":1.1352437156274986},{"$f":"C91*B91/2-2*(B110+C110)","v":3.7335772658587452E-2},{"$f":"E110*2","v":7.4671545317174903E-2},{"$f":"D110+F110","v":1.2099152609446735}]
[]
[]
[]
[]
[]
[]
[]
[]
[]
[]
[]
[]
[]
[]
[]
[]
[]
[]
[]
[]
[{"$f":"U7","v":"STEP-2：影響円D範囲(b≦D<a）"}]
[null,"杭径：ｄ",{"$f":"F3","v":1}]
[null,{"$f":"C90","v":"短辺：a"},{"$f":"D90","v":"長辺：b"},"高さ：H","影響円：D","角度:δ211","角度:δ212",null,"高さ:h21"]
[null,{"$f":"F4","v":2.2999999999999998},{"$f":"F5","v":2.2999999999999998},{"$f":"E19","v":0},{"$f":"$C$48+2*D134/TAN($C$67)","v":1},{"$f":"ACOS(B134/E134)","v":{"$error":"#NUM!"}},{"$f":"PI()/2-F134","v":{"$error":"#NUM!"}},null,{"$f":"B134/2*TAN(F134)","v":{"$error":"#NUM!"}}]
[null,null,null,null,null,"角度:δ221","角度:δ222","角度:δ223","ｈ221","ｈ222"]
[null,null,null,null,null,{"$f":"ACOS(C132/E134)","v":0},{"$f":"ACOS(B134/E134)","v":{"$error":"#NUM!"}},{"$f":"PI()/2-F136-G136","v":{"$error":"#NUM!"}},{"$f":"C132/2*TAN(F136)","v":0},{"$f":"B134/2*TAN(G136)","v":{"$error":"#NUM!"}}]
[null,{"$f":"A131","v":"STEP-2：影響円D範囲(b≦D<a）"}]
[]
[]
[]
[]
[]
[]
[]
[]
[]
[]
[]
[]
[]
[]
[null,"面積:A211","面積:A212","A2-1"]
[null,{"$f":"1/4*I134*B134","v":{"$error":"#NUM!"}},{"$f":"G134*E134^2/8","v":{"$error":"#NUM!"}},{"$f":"C134*B134-4*(B153+C153)","v":{"$error":"#NUM!"}}]
[null,"A221","A222","A223","A2-2","2×A2-2",null,null,"面積A2"]
[null,{"$f":"C132*I136/4","v":0},{"$f":"J136*B134/4","v":{"$error":"#NUM!"}},{"$f":"H136*E134^2/8","v":{"$error":"#NUM!"}},{"$f":"C132*B134/2-2*(B155+C155+D155)","v":{"$error":"#NUM!"}},{"$f":"E155*2","v":{"$error":"#NUM!"}},null,null,{"$f":"D153+F155","v":{"$error":"#NUM!"}}]
[]
[]
[]
[]
[]
[]
[]
[]
[]
[]
[]
[]
[]
[]
[]
[]
[]
[]
[{"$f":"U8","v":"STEP-3：影響円D範囲(a≦D<k）"}]
[]
[null,"杭径：ｄ",{"$f":"E47","v":"短辺：a"},{"$f":"F47","v":"長辺：b"},"高さ：H","影響円：D","角度:δ211","角度:δ212","高さ:h21"]
[null,{"$f":"F3","v":1},{"$f":"E48","v":2.2999999999999998},{"$f":"F48","v":2.2999999999999998},{"$f":"E20","v":8.6181865171026146},{"$f":"$C$48+2*E177/TAN($C$67)","v":2.5079872407968904},{"$f":"ACOS(C177/F177)","v":0.41012734054149091},{"$f":"PI()/2-G177","v":1.1606689862534056},{"$f":"C177/2*TAN(G177)","v":0.49999999999999989}]
[]
[]
[null,{"$f":"A174","v":"STEP-3：影響円D範囲(a≦D<k）"}]
[]
[]
[]
[]
[]
[]
[]
[]
[]
[]
[]
[]
[]
[]
[null,"面積:A211","面積:A212","A2-1","面積:A221","面積:A222","A2-2","2×A2-2","面積A2"]
[null,{"$f":"1/4*I177*C177","v":0.28749999999999992},{"$f":"H177*F177^2/8","v":0.91257599044174009},{"$f":"D177*C177-4*(B196+C196)","v":0.48969603823303931},{"$f":"B177*I179/4","v":0},{"$f":"H179*F177^2/8","v":0},0,{"$f":"G196*2","v":0},{"$f":"D196+H196","v":0.48969603823303931}]
[]
[]
[]
[]
[]
[]
[]
[]
[]
[]
[]
[]
[]
[]
[]
[]
[]
[]
[]
[]
[{"$f":"U9","v":"STEP-4：影響円D範囲(k≦D≦max）"}]
[null,"杭径：ｄ",{"$f":"F3","v":1}]
[null,"短辺：a","長辺：ｂ","高さ：H","影響円：D","角度:δ311","角度:δ312","角度:δ313","ｈ311","ｈ312"]
[null,{"$f":"P26","v":2.2999999999999998},{"$f":"Q26","v":2.2999999999999998},{"$f":"E21","v":0},{"$f":"$C$48+2*D220/TAN($C$67)","v":1},{"$f":"ACOS(C220/E220)","v":{"$error":"#NUM!"}},{"$f":"ACOS(B220/E220)","v":{"$error":"#NUM!"}},{"$f":"PI()/2-F220-G220","v":{"$error":"#NUM!"}},{"$f":"C220/2*TAN(F220)","v":{"$error":"#NUM!"}},{"$f":"B220/2*TAN(G220)","v":{"$error":"#NUM!"}}]
[null,"短辺：a","長辺：ｂ","高さ：H","影響円：D","角度:δ321","角度:δ322","角度:δ323","ｈ321","ｈ322"]
[null,{"$f":"B220","v":2.2999999999999998},{"$f":"C220","v":2.2999999999999998},{"$f":"D220","v":0},{"$f":"E220","v":1},{"$f":"ACOS(C218/E220)","v":0},{"$f":"ACOS(B220/E220)","v":{"$error":"#NUM!"}},{"$f":"PI()/2-F222-G222","v":{"$error":"#NUM!"}},{"$f":"C218/2*TAN(F222)","v":0},{"$f":"B220/2*TAN(G222)","v":{"$error":"#NUM!"}}]
[]
[null,{"$f":"A217","v":"STEP-4：影響円D範囲(k≦D≦max）"}]
[]
[]
[]
[]
[]
[]
[]
[]
[]
[]
[]
[]
[]
[null,"A311","A312","A313","A3-1",null,"面積A3"]
[null,{"$f":"C220*I220/4","v":{"$error":"#NUM!"}},{"$f":"J220*B220/4","v":{"$error":"#NUM!"}},{"$f":"H220*E220^2/8","v":{"$error":"#NUM!"}},{"$f":"B220*C220-4*(B239+C239+D239)","v":{"$error":"#NUM!"}},null,{"$f":"E239+F241","v":{"$error":"#NUM!"}}]
[]
[]
[]
[]
[]
[]
[]
[]
[]
[]
[]
[]
[]
[]
[]
[]
[]
[]
[]
[null,null,null,null,null,null,null,null,null,null,"＊"]

{"sheet":"二軸千鳥配置","index":6,"n_rows":258,"n_cols":64,"rows_kept":258,"cut":false,"hidden":false,"merged":[[9,2,9,3],[10,2,10,3],[15,6,15,9],[1,1,1,3],[2,1,7,1],[2,2,2,3],[2,7,2,9],[3,2,4,3],[3,7,3,9],[4,7,4,9],[5,7,5,9],[7,2,7,3],[12,1,13,1],[12,4,13,4],[12,5,13,5],[12,6,13,6]]}
["盛土体積 計算条件",null,null,null,null,null,null,null,null,null,null,"☆","⇦検討条件参照先"]
[null,"項　　　目",null,null,"記号","値","単位","備考",null,null,null,null,null,null,null,null,null,"ー積分計算に使用する部分ー"]
[null,"セメント\nコラム\n改良体","改良体直径",null,"ｄ",{"$f":"INDIRECT(\"'\"&$L$1&\"'!\"&L3)","v":1},"m",null,null,null,null,"F4","改良体直径はd＝0.6～1.3m",null,null,null,null,null,null,{"$f":"VLOOKUP(\"〇\",U12:W14,3,FALSE)","v":5}]
[null,null,"改良体間隔\n (改良体中心間隔)",null,"a",{"$f":"F3","v":1},"〃",null,null,null,null,"F5","改良体間隔はλ＝1.0～2.5m",null,null,null,null,"影響円直径D","その時の高さ","面積","面積計算STEP",null,null,null,"影響円の範囲"]
[null,null,null,null,"b",{"$f":"INDIRECT(\"'\"&$L$1&\"'!\"&L5)","v":2.2999999999999998},"〃",null,null,null,null,"F6","改良率はap＝10%以上",null,null,null,null,null,null,{"$f":"T18","v":-0.78539816339744828},{"$f":"U18","v":"STEP-0：底面積（d=D）"}]
[null,null,"分担面　横：L",null,"L",{"$f":"INDIRECT(\"'\"&$L$1&\"'!\"&L6)","v":""},"〃",null,null,null,null,"F7",null,null,null,null,1,{"$f":"SMALL($M$18:$M$22,Q6)","v":{"$error":"#DIV/0!"}},{"$f":"SMALL($N$18:$N$22,Q6)","v":{"$error":"#DIV/0!"}},{"$f":"VLOOKUP(R7,$M$19:$R$22,T3,FALSE)","v":{"$error":"#DIV/0!"}},{"$f":"X6&Y6&Z6&AA6&\"）\"","v":{"$error":"#DIV/0!"}},null,null,"STEP-1：影響円D範囲(",{"$f":"R18","v":"d"},"≦D<",{"$f":"VLOOKUP(R7,$M$19:$R$22,6,FALSE)","v":{"$error":"#DIV/0!"}}]
[null,null,"分担面　縦：h",null,"h",{"$f":"INDIRECT(\"'\"&$L$1&\"'!\"&L7)","v":0},"〃",null,null,null,null,"F8",null,null,null,null,2,{"$f":"SMALL($M$18:$M$22,Q7)","v":{"$error":"#DIV/0!"}},{"$f":"SMALL($N$18:$N$22,Q7)","v":{"$error":"#DIV/0!"}},{"$f":"VLOOKUP(R8,$M$19:$R$22,T3,FALSE)","v":{"$error":"#DIV/0!"}},{"$f":"X7&Y7&Z7&AA7&\"）\"","v":{"$error":"#DIV/0!"}},null,null,"STEP-2：影響円D範囲(",{"$f":"AA6","v":{"$error":"#DIV/0!"}},"≦D<",{"$f":"VLOOKUP(R8,$M$19:$R$22,6,FALSE)","v":{"$error":"#DIV/0!"}}]
[null,null,"改良率",null,"ａp",{"$f":"ROUNDDOWN(U26,3)","v":{"$error":"#VALUE!"}},"-",null,null,null,null,"F13","盛土高",null,null,null,3,{"$f":"SMALL($M$18:$M$22,Q8)","v":{"$error":"#DIV/0!"}},{"$f":"SMALL($N$18:$N$22,Q8)","v":{"$error":"#DIV/0!"}},{"$f":"VLOOKUP(R9,$M$19:$R$22,T3,FALSE)","v":{"$error":"#DIV/0!"}},{"$f":"X8&Y8&Z8&AA8&\"）\"","v":{"$error":"#DIV/0!"}},null,null,"STEP-3：影響円D範囲(",{"$f":"AA7","v":{"$error":"#DIV/0!"}},"≦D<",{"$f":"VLOOKUP(R9,$M$19:$R$22,6,FALSE)","v":{"$error":"#DIV/0!"}}]
[null,null,null,null,null,null,null,null,null,null,null,null,"計画高","原地盤高",null,null,4,{"$f":"SMALL($M$18:$M$22,Q9)","v":{"$error":"#DIV/0!"}},{"$f":"SMALL($N$18:$N$22,Q9)","v":{"$error":"#DIV/0!"}},{"$f":"VLOOKUP(R10,$M$19:$R$22,T3,FALSE)","v":{"$error":"#DIV/0!"}},{"$f":"X9&Y9&Z9&AA9&\"）\"","v":{"$error":"#DIV/0!"}},null,null,"STEP-4：影響円D範囲(",{"$f":"AA8","v":{"$error":"#DIV/0!"}},"≦D≦",{"$f":"R22","v":"2r"}]
[null,null,null,null,null,null,null,null,null,null,null,null,{"$f":"INDIRECT(\"'\"&$L$1&\"'!\"&O10)","v":2.59},{"$f":"INDIRECT(\"'\"&$L$1&\"'!\"&P10)","v":0},"L12","M12",5,{"$f":"SMALL($M$18:$M$22,Q10)","v":{"$error":"#DIV/0!"}},{"$f":"SMALL($N$18:$N$22,Q10)","v":{"$error":"#DIV/0!"}},0,"計算範囲外",null,null,null,{"$f":"AA9","v":"2r"}]
[]
[null,"盛土条件","盛土高さ",null,"Ｈe",{"$f":"INDIRECT(\"'\"&$L$1&\"'!\"&L8)","v":2.59},"m",{"$f":"+IF(AND(M10=\"\",N10=\"\"),\"\",\"ＦH＝\"&FIXED(M10,2)&\"m，ＧL＝\"&FIXED(N10,2)&\"m\")","v":"ＦH＝2.59m，ＧL＝0.00m"},null,null,null,"F15","D15",null,null,null,null,null,null,"Case1",{"$f":"IF(Z26>=Q26,\"〇\",\"-\")","v":"-"},"b≦j",3]
[null,"塑性角","改良形式：",{"$f":"INDIRECT(\"'\"&$L$1&\"'!\"&M12)","v":"浮き型"},"θ",{"$f":"INDIRECT(\"'\"&$L$1&\"'!\"&L12)","v":85},"度",null,null,null,null,null,"D16",null,null,null,null,null,null,"Case2",{"$f":"IF(AND(Z26<Q26,AA26>=Q26),\"〇\",\"-\")","v":"-"},"j<b≦k",4]
[null,null,"補助工法：",{"$f":"INDIRECT(\"'\"&$L$1&\"'!\"&M13)","v":"浅層改良"},null,null,null,null,null,null,null,null,null,null,null,null,null,null,null,"Case3",{"$f":"IF(AA26<Q26,\"〇\",\"-\")","v":"〇"},"k<b",5]
[null,null,null,null,null,null,null,null,null,null,null,null,"Case1：b≦jの場合",null,3,4,5,null,null,null,null,null,null,null,null,null,null,null,null,null,"Case2：j<b≦kの場合",null,null,null,null,null,null,null,null,null,null,null,null,null,null,null,null,null,"Case3：k≦bの場合"]
[null,"影響円D","影響円直径D","その時の高さ","高さ:計算例","面積:計算例","概要",null,null,null,null,null,"影響円直径D","その時の高さ","面積",null,null,"影響円D"]
[null,{"$f":"Y6","v":"d"},{"$f":"R6","v":{"$error":"#DIV/0!"}},{"$error":"#DIV/0!"},1.59375,{"$f":"H66","v":-0.78539816339744828},"STEP0 …底面積A0",null,null,null,null,null,null,null,"case1","Case2","Case3",null,null,null,null,null,null,null,null,null,null,null,null,null,"影響円直径D","その時の高さ","面積","影響円D",null,null,null,null,null,null,null,null,null,null,null,null,null,null,"影響円直径D","その時の高さ","面積","影響円D"]
[null,{"$f":"Y7","v":{"$error":"#DIV/0!"}},{"$error":"#DIV/0!"},{"$error":"#DIV/0!"},{"$f":"D18","v":{"$error":"#DIV/0!"}},{"$f":"F109","v":{"$error":"#DIV/0!"}},"STEP1 …底面積A1",null,null,null,null,null,{"$f":"$N$26","v":1},{"$f":"(M18-N26)/2*TAN(O30)","v":0},{"$f":"V30","v":-0.78539816339744828},{"$f":"AN30","v":-0.78539816339744828},{"$f":"BF30","v":-0.78539816339744828},"d",null,{"$f":"O18","v":-0.78539816339744828},"STEP-0：底面積（d=D）",null,null,null,null,null,null,null,null,null,{"$f":"$N$26","v":1},{"$f":"(AE18-AF26)/2*TAN(AG30)","v":0},{"$f":"AN30","v":-0.78539816339744828},"d",null,null,null,{"$f":"P18","v":-0.78539816339744828},{"$f":"U18","v":"STEP-0：底面積（d=D）"},null,null,null,null,null,null,null,null,null,{"$f":"$N$26","v":1},{"$f":"(AW18-AX26)/2*TAN(AY30)","v":0},{"$f":"BF30","v":-0.78539816339744828},"d",null,null,null,{"$f":"Q18","v":-0.78539816339744828},{"$f":"AK44","v":0.26360065531686971}]
[null,{"$f":"Y8","v":{"$error":"#DIV/0!"}},{"$error":"#DIV/0!"},{"$error":"#DIV/0!"},{"$f":"D19","v":{"$error":"#DIV/0!"}},{"$f":"G152","v":{"$error":"#DIV/0!"}},"STEP2…底面積A2",null,null,null,null,null,{"$f":"$Z$26","v":0.64999999999999991},{"$f":"(M19-N26)/2*TAN(O30)","v":-2.0002591529832365},{"$f":"AA39","v":{"$error":"#NUM!"}},{"$f":"AS34","v":-1.4935557123364647},{"$f":"BK34","v":-1.4935557123364647},"j",{"$f":"N18","v":0},{"$f":"O19","v":{"$error":"#NUM!"}},"STEP-1影響円Dの範囲（d≦D≦b）左右が接するまで",null,null,null,null,"☆",null,null,null,null,{"$f":"$Z$26","v":0.64999999999999991},{"$f":"(AE19-AF26)/2*TAN(AG30)","v":-2.0002591529832365},{"$f":"AS34","v":-1.4935557123364647},"j",null,null,{"$f":"AF18","v":0},{"$f":"P19","v":-1.4935557123364647},"STEP-1影響円Dの範囲（d≦D≦j）上下が接するまで",null,null,null,null,null,null,null,null,null,{"$f":"$Z$26","v":0.64999999999999991},{"$f":"(AW19-AX26)/2*TAN(AY30)","v":-2.0002591529832365},{"$f":"BK34","v":-1.4935557123364647},"j",null,null,{"$f":"AX18","v":0},{"$f":"Q19","v":-1.4935557123364647},"STEP-1影響円Dの範囲（d≦D≦j）左右が接するまで"]
[null,{"$f":"Y9","v":{"$error":"#DIV/0!"}},{"$error":"#DIV/0!"},{"$error":"#DIV/0!"},{"$f":"D20","v":{"$error":"#DIV/0!"}},{"$f":"H195","v":{"$error":"#DIV/0!"}},"STEP3 …底面積A3",null,null,null,null,null,{"$f":"AA26","v":1.65},{"$f":"(M20-N26)/2*TAN(O30)","v":3.7147669983974376},{"$f":"AA44","v":{"$error":"#NUM!"}},{"$f":"AS44","v":{"$error":"#NUM!"}},{"$f":"BK39","v":-0.74703680247598148},"k",{"$f":"N19","v":-2.0002591529832365},{"$f":"O20","v":{"$error":"#NUM!"}},"STEP-2影響円Dの範囲（b≦D≦j）上下が接するまで",null,null,null,null,"I26",{"$f":"INDIRECT(\"'\"&$Z$19&\"'!\"&Z20)","v":2.59},null,null,null,{"$f":"AS26","v":1.65},{"$f":"(AE20-AF26)/2*TAN(AG30)","v":3.7147669983974376},{"$f":"AS39","v":-0.74703680247598148},"k",null,null,{"$f":"AF19","v":-2.0002591529832365},{"$f":"P20","v":{"$error":"#NUM!"}},"STEP-2影響円Dの範囲（j≦D≦b）左右が接するまで",null,null,null,null,null,null,null,null,null,{"$f":"BK26","v":1.65},{"$f":"(AW20-AX26)/2*TAN(AY30)","v":3.7147669983974376},{"$f":"BK39","v":-0.74703680247598148},"k",null,null,{"$f":"AX19","v":-2.0002591529832365},{"$f":"Q20","v":-0.74703680247598148},"STEP-2影響円Dの範囲（j≦D≦k）対角が接するまで"]
[null,{"$f":"Y10","v":"2r"},{"$error":"#DIV/0!"},{"$error":"#DIV/0!"},{"$f":"D21","v":{"$error":"#DIV/0!"}},{"$f":"H238","v":{"$error":"#DIV/0!"}},"STEP4 …底面積A4",null,null,null,null,null,{"$f":"Q26","v":2.2999999999999998},{"$f":"(M21-N26)/2*TAN(O30)","v":7.4295339967948753},{"$f":"AA34","v":-1.4935557123364647},{"$f":"AS39","v":-0.74703680247598148},{"$f":"BK44","v":-0.74703680247598148},"b",{"$f":"N20","v":3.7147669983974376},{"$f":"O21","v":-1.4935557123364647},"STEP-3影響円Dの範囲（j≦D≦k）対角が接するまで",null,null,null,null,"採用値",null,null,null,null,{"$f":"AI26","v":2.2999999999999998},{"$f":"(AE21-AF26)/2*TAN(AG30)","v":7.4295339967948753},{"$f":"AS44","v":{"$error":"#NUM!"}},"b",null,null,{"$f":"AF20","v":3.7147669983974376},{"$f":"P21","v":-0.74703680247598148},"STEP-3影響円Dの範囲（b≦D≦k）対角が接するまで",null,null,null,null,null,null,null,null,null,{"$f":"BA26","v":2.2999999999999998},{"$f":"(AW21-AX26)/2*TAN(AY30)","v":7.4295339967948753},{"$f":"BK44","v":-0.74703680247598148},"b",null,null,{"$f":"AX20","v":3.7147669983974376},{"$f":"Q21","v":-0.74703680247598148},"STEP-3影響円Dの範囲（k≦D≦b）左右が接するまで"]
[null,null,null,null,null,null,null,null,null,null,null,null,{"$f":"AB26*2","v":{"$error":"#DIV/0!"}},{"$f":"(M22-N26)/2*TAN(O30)","v":{"$error":"#DIV/0!"}},{"$f":"AA49","v":{"$error":"#NUM!"}},{"$f":"AS49","v":{"$error":"#NUM!"}},{"$f":"BK49","v":{"$error":"#NUM!"}},"2r",{"$f":"N21","v":7.4295339967948753},{"$f":"O22","v":{"$error":"#NUM!"}},"STEP-4：(2r)が接するまで",null,null,null,null,"高さ","面積","step",null,null,{"$f":"AT26*2","v":{"$error":"#DIV/0!"}},{"$f":"(AE22-AF26)/2*TAN(AG30)","v":{"$error":"#DIV/0!"}},{"$f":"AS49","v":{"$error":"#NUM!"}},"2r",null,null,{"$f":"AF21","v":7.4295339967948753},{"$f":"P22","v":{"$error":"#NUM!"}},{"$f":"AE45","v":"STEP-4：(2r)が接するまで"},null,null,null,null,null,null,null,null,null,{"$f":"BL26*2","v":{"$error":"#DIV/0!"}},{"$f":"(AW22-AX26)/2*TAN(AY30)","v":{"$error":"#DIV/0!"}},{"$f":"BK49","v":{"$error":"#NUM!"}},"2r",null,null,{"$f":"AX21","v":7.4295339967948753},{"$f":"Q22","v":{"$error":"#NUM!"}},{"$f":"AW45","v":"STEP-4：(2r)が接するまで"}]
[null,null,null,null,null,null,null,null,null,null,null,null,null,null,null,null,null,null,{"$f":"N22","v":{"$error":"#DIV/0!"}},{"$f":"P23","v":0},"計算範囲外",null,null,null,null,{"$f":"INDIRECT(\"'\"&$Z$19&\"'!\"&Z20)","v":2.59},{"$f":"IF(Z23=0,O18,VLOOKUP(Z23,S5:T10,2,TRUE))","v":{"$error":"#N/A"}},{"$f":"IF(Z23=0,U5,VLOOKUP(Z23,S5:U10,3,TRUE))","v":{"$error":"#N/A"}},null,null,null,null,null,null,null,null,{"$f":"AF22","v":{"$error":"#DIV/0!"}},{"$f":"AH23","v":0},"計算範囲外",null,null,null,null,null,null,null,null,null,null,null,null,null,null,null,{"$f":"AX22","v":{"$error":"#DIV/0!"}},{"$f":"AZ23","v":0},"計算範囲外"]
[null,null,null,null,null,null,null,null,null,null,null,null,"STEP-0：底面積",null,null,null,null,null,null,null,null,null,null,null,null,null,null,null,null,null,"STEP-0：底面積",null,null,null,null,null,null,null,null,null,null,null,null,null,null,null,null,null,"STEP-0：底面積"]
[null,null,null,null,null,null,{"$f":"U9","v":{"$error":"#DIV/0!"}},null,null,null,null,null,"項目","杭径：ｄ","杭面積","台形上辺 ：a","台形底辺 ：b","分担面横：L","分担面縦：h","面積：Lh","改良率","（a+b）*h/2",null,"（ｂ-ｄ）/2","（ｂ+ｄ）/2","接円距離：j","対角距離：k","ｒ",null,null,"項目","杭径：ｄ","杭面積","台形上辺 ：a","台形底辺 ：b","分担面横：L","分担面縦：h","面積：Lh","改良率","（a+b）*h/2",null,"（ｂ-ｄ）/2","（ｂ+ｄ）/2","接円距離：j","対角距離：k","ｒ",null,null,"項目","杭径：ｄ","杭面積","台形上辺 ：a","台形底辺 ：b","分担面横：L","分担面縦：h","面積：Lh","改良率","（a+b）*h/2",null,"（ｂ-ｄ）/2","（ｂ+ｄ）/2","接円距離：j","対角距離：k","ｒ"]
[null,null,null,null,null,null,null,null,null,null,null,null,"数値",{"$f":"$F$3","v":1},{"$f":"PI()*N26^2/4","v":0.78539816339744828},{"$f":"$F$4","v":1},{"$f":"$F$5","v":2.2999999999999998},{"$f":"$F$6","v":""},{"$f":"$F$7","v":0},{"$f":"R26*S26","v":{"$error":"#VALUE!"}},{"$f":"(O26*2/T26)","v":{"$error":"#VALUE!"}},{"$f":"(P26+Q26)/2*S26","v":0},null,{"$f":"(Q26-N26)/2","v":0.64999999999999991},{"$f":"(Q26+N26)/2","v":1.65},{"$f":"SQRT(P28+Q28)","v":0.64999999999999991},{"$f":"SQRT(P28+R28)","v":1.65},{"$f":"SQRT(U28+S28*T28/8+(S28*T28/(8*S26))^2+V28)","v":{"$error":"#DIV/0!"}},null,null,"数値",{"$f":"$F$3","v":1},{"$f":"PI()*AF26^2/4","v":0.78539816339744828},{"$f":"$F$4","v":1},{"$f":"$F$5","v":2.2999999999999998},{"$f":"$F$6","v":""},{"$f":"$F$7","v":0},{"$f":"AJ26*AK26","v":{"$error":"#VALUE!"}},{"$f":"(AG26*2/AL26)","v":{"$error":"#VALUE!"}},{"$f":"(AH26+AI26)/2*AK26","v":0},null,{"$f":"(AI26-AF26)/2","v":0.64999999999999991},{"$f":"(AI26+AF26)/2","v":1.65},{"$f":"SQRT(AH28+AI28)","v":0.64999999999999991},{"$f":"SQRT(AH28+AJ28)","v":1.65},{"$f":"SQRT(AM28+AK28*AL28/8+(AK28*AL28/(8*AK26))^2+AN28)","v":{"$error":"#DIV/0!"}},null,null,"数値",{"$f":"$F$3","v":1},{"$f":"PI()*AX26^2/4","v":0.78539816339744828},{"$f":"$F$4","v":1},{"$f":"$F$5","v":2.2999999999999998},{"$f":"$F$6","v":""},{"$f":"$F$7","v":0},{"$f":"BB26*BC26","v":{"$error":"#VALUE!"}},{"$f":"(AY26*2/BD26)","v":{"$error":"#VALUE!"}},{"$f":"(AZ26+BA26)/2*BC26","v":0},null,{"$f":"(BA26-AX26)/2","v":0.64999999999999991},{"$f":"(BA26+AX26)/2","v":1.65},{"$f":"SQRT(AZ28+BA28)","v":0.64999999999999991},{"$f":"SQRT(AZ28+BB28)","v":1.65},{"$f":"SQRT(BE28+BC28*BD28/8+(BC28*BD28/(8*BC26))^2+BF28)","v":{"$error":"#DIV/0!"}}]
[null,null,null,null,null,null,{"$f":"U8","v":{"$error":"#DIV/0!"}},null,null,null,null,null,null,"ｄ2","b2","h2","［（ｂ-ｄ）/2］2","［（ｂ+ｄ）/2］2","A=d-b","B=d+b","(h/2)2","(b/2)2","(d/2)2","α","β","γ","検算ｈ","別式ｒ",null,null,null,"ｄ2","b2","h2","［（ｂ-ｄ）/2］2","［（ｂ+ｄ）/2］2","A=d-b","B=d+b","(h/2)2","(b/2)2","(d/2)2","α","β","γ","検算ｈ","別式ｒ",null,null,null,"ｄ2","b2","h2","［（ｂ-ｄ）/2］2","［（ｂ+ｄ）/2］2","A=d-b","B=d+b","(h/2)2","(b/2)2","(d/2)2","α","β","γ","検算ｈ","別式ｒ"]
[null,null,null,null,null,null,null,null,null,null,null,null,null,{"$f":"N26^2","v":1},{"$f":"Q26^2","v":5.2899999999999991},{"$f":"S26^2","v":0},{"$f":"X26^2","v":0.42249999999999988},{"$f":"Y26^2","v":2.7224999999999997},{"$f":"N26-Q26","v":-1.2999999999999998},{"$f":"N26+Q26","v":3.3},{"$f":"(S26/2)^2","v":0},{"$f":"(Q26/2)^2","v":1.3224999999999998},{"$f":"(N26/2)^2","v":0.25},{"$f":"ATAN(S26/X26)","v":0},{"$f":"PI()-X28","v":3.1415926535897931},{"$f":"ATAN(S26/Y26)","v":0},{"$f":"SQRT((AB26^2-V28))+SQRT((AB26^2-W28))","v":{"$error":"#DIV/0!"}},{"$f":"0.5*SQRT(P28+(N28+O28)/2+(N28-O28)^2/(16*P28))","v":{"$error":"#DIV/0!"}},null,null,null,{"$f":"AF26^2","v":1},{"$f":"AI26^2","v":5.2899999999999991},{"$f":"AK26^2","v":0},{"$f":"AP26^2","v":0.42249999999999988},{"$f":"AQ26^2","v":2.7224999999999997},{"$f":"AF26-AI26","v":-1.2999999999999998},{"$f":"AF26+AI26","v":3.3},{"$f":"(AK26/2)^2","v":0},{"$f":"(AI26/2)^2","v":1.3224999999999998},{"$f":"(AF26/2)^2","v":0.25},{"$f":"ATAN(AK26/AP26)","v":0},{"$f":"PI()-AP28","v":3.1415926535897931},{"$f":"ATAN(AK26/AQ26)","v":0},{"$f":"SQRT((AT26^2-AN28))+SQRT((AT26^2-AO28))","v":{"$error":"#DIV/0!"}},{"$f":"0.5*SQRT(AH28+(AF28+AG28)/2+(AF28-AG28)^2/(16*AH28))","v":{"$error":"#DIV/0!"}},null,null,null,{"$f":"AX26^2","v":1},{"$f":"BA26^2","v":5.2899999999999991},{"$f":"BC26^2","v":0},{"$f":"BH26^2","v":0.42249999999999988},{"$f":"BI26^2","v":2.7224999999999997},{"$f":"AX26-BA26","v":-1.2999999999999998},{"$f":"AX26+BA26","v":3.3},{"$f":"(BC26/2)^2","v":0},{"$f":"(BA26/2)^2","v":1.3224999999999998},{"$f":"(AX26/2)^2","v":0.25},{"$f":"ATAN(BC26/BH26)","v":0},{"$f":"PI()-BH28","v":3.1415926535897931},{"$f":"ATAN(BC26/BI26)","v":0},{"$f":"SQRT((BL26^2-BF28))+SQRT((BL26^2-BG28))","v":{"$error":"#DIV/0!"}},{"$f":"0.5*SQRT(AZ28+(AX28+AY28)/2+(AX28-AY28)^2/(16*AZ28))","v":{"$error":"#DIV/0!"}}]
[null,null,null,null,null,null,{"$f":"U7","v":{"$error":"#DIV/0!"}},null,null,null,null,null,null,"塑性角：θ","ラジアン","高さ：H","影響円：D","k","max","面積A0-1","面積2A0-2","面積A0",null,null,null,null,null,null,null,null,null,"塑性角：θ","ラジアン","高さ：H","影響円：D","k","max","面積A0-1","面積2A0-2","面積A0",null,null,null,null,null,null,null,null,null,"塑性角：θ","ラジアン","高さ：H","影響円：D","k","max","面積A0-1","面積2A0-2","面積A0"]
[null,null,null,null,null,null,null,null,null,null,null,null,null,{"$f":"$F$13","v":85},{"$f":"RADIANS(N30)","v":1.4835298641951802},{"$f":"$Z$23","v":2.59},{"$f":"N26+2*P30/TAN(O30)","v":1.4531912770642861},{"$f":"SQRT((N26^2+P26^2))","v":1.4142135623730951},{"$f":"SQRT((P26^2+Q26^2))","v":2.5079872407968904},{"$f":"P26*Q26-O26","v":1.5146018366025515},{"$f":"N26*P26-O26","v":0.21460183660255172},{"$f":"V26-O26","v":-0.78539816339744828},null,null,null,null,null,null,null,null,null,{"$f":"$F$13","v":85},{"$f":"RADIANS(AF30)","v":1.4835298641951802},{"$f":"$Z$23","v":2.59},{"$f":"AF26+2*AH30/TAN(AG30)","v":1.4531912770642861},{"$f":"SQRT((AF26^2+AH26^2))","v":1.4142135623730951},{"$f":"SQRT((AH26^2+AI26^2))","v":2.5079872407968904},{"$f":"AH26*AI26-AG26","v":1.5146018366025515},{"$f":"AF26*AH26-AG26","v":0.21460183660255172},{"$f":"AN26-AG26","v":-0.78539816339744828},null,null,null,null,null,null,null,null,null,{"$f":"$F$13","v":85},{"$f":"RADIANS(AX30)","v":1.4835298641951802},{"$f":"$Z$23","v":2.59},{"$f":"AX26+2*AZ30/TAN(AY30)","v":1.4531912770642861},{"$f":"SQRT((AX26^2+AZ26^2))","v":1.4142135623730951},{"$f":"SQRT((AZ26^2+BA26^2))","v":2.5079872407968904},{"$f":"AZ26*BA26-AY26","v":1.5146018366025515},{"$f":"AX26*AZ26-AY26","v":0.21460183660255172},{"$f":"BF26-AY26","v":-0.78539816339744828}]
[null,null,null,null,null,null,{"$f":"U6","v":{"$error":"#DIV/0!"}}]
[null,null,null,null,null,null,null,null,null,null,null,null,{"$f":"U19","v":"STEP-1影響円Dの範囲（d≦D≦b）左右が接するまで"},null,null,null,null,null,null,null,null,null,null,null,null,null,null,null,null,null,{"$f":"AM19","v":"STEP-1影響円Dの範囲（d≦D≦j）上下が接するまで"},null,null,null,null,null,null,null,null,null,null,null,null,null,null,null,null,null,{"$f":"BE19","v":"STEP-1影響円Dの範囲（d≦D≦j）左右が接するまで"}]
[null,null,null,null,null,null,{"$f":"U5","v":"STEP-0：底面積（d=D）"},null,null,null,null,null,"杭径：ｄ","台形上辺 ：a","台形底辺 ：b","高さ：H","影響円：D","α","β","角度:δ1","高さ:h1","A1-1","A1-2","A1-3",null,"台形面積","面積A1",null,null,null,"杭径：ｄ","台形上辺 ：a","台形底辺 ：b","高さ：H","影響円：D","α","β","角度:δ1","高さ:h1","A1-1","A1-2","A1-3",null,"台形面積","面積A1",null,null,null,"杭径：ｄ","台形上辺 ：a","台形底辺 ：b","高さ：H","影響円：D","α","β","角度:δ1","高さ:h1","A1-1","A1-2","A1-3",null,"台形面積","面積A1"]
[null,null,null,null,null,null,null,null,null,null,null,null,{"$f":"N26","v":1},{"$f":"P26","v":1},{"$f":"Q26","v":2.2999999999999998},{"$f":"P30","v":2.59},{"$f":"Q30","v":1.4531912770642861},{"$f":"$X$28","v":0},{"$f":"$Y$28","v":3.1415926535897931},{"$f":"ACOS(M34/Q34)","v":0.81187296904977169},{"$f":"M34/2*TAN(T34)","v":0.52720131063373943},{"$f":"(S34-T34)*Q34^2/8","v":0.61497752850979748},{"$f":"M34*U34/2","v":0.26360065531686971},{"$f":"R34*Q34^2/8","v":0},null,{"$f":"V26","v":0},{"$f":"Z34-(2*V34+W34+2*X34)","v":-1.4935557123364647},null,null,null,{"$f":"AF26","v":1},{"$f":"AH26","v":1},{"$f":"AI26","v":2.2999999999999998},{"$f":"AH30","v":2.59},{"$f":"AI30","v":1.4531912770642861},{"$f":"$X$28","v":0},{"$f":"$Y$28","v":3.1415926535897931},{"$f":"ACOS(AE34/AI34)","v":0.81187296904977169},{"$f":"AE34/2*TAN(AL34)","v":0.52720131063373943},{"$f":"(AK34-AL34)*AI34^2/8","v":0.61497752850979748},{"$f":"AE34*AM34/2","v":0.26360065531686971},{"$f":"AJ34*AI34^2/8","v":0},null,{"$f":"AN26","v":0},{"$f":"AR34-(2*AN34+AO34+2*AP34)","v":-1.4935557123364647},null,null,null,{"$f":"AX26","v":1},{"$f":"AZ26","v":1},{"$f":"BA26","v":2.2999999999999998},{"$f":"AZ30","v":2.59},{"$f":"BA30","v":1.4531912770642861},{"$f":"$X$28","v":0},{"$f":"$Y$28","v":3.1415926535897931},{"$f":"ACOS(AW34/BA34)","v":0.81187296904977169},{"$f":"AW34/2*TAN(BD34)","v":0.52720131063373943},{"$f":"(BC34-BD34)*BA34^2/8","v":0.61497752850979748},{"$f":"AW34*BE34/2","v":0.26360065531686971},{"$f":"BB34*BA34^2/8","v":0},null,{"$f":"BF26","v":0},{"$f":"BJ34-(2*BF34+BG34+2*BH34)","v":-1.4935557123364647}]
[null,null,null,null,null,null,null,null,null,null,null,null,{"$f":"U20","v":"STEP-2影響円Dの範囲（b≦D≦j）上下が接するまで"},null,null,null,null,null,null,null,null,null,null,null,null,null,null,null,null,null,{"$f":"AM20","v":"STEP-2影響円Dの範囲（j≦D≦b）左右が接するまで"},null,null,null,null,null,null,null,null,null,null,null,null,null,null,null,null,null,{"$f":"BE20","v":"STEP-2影響円Dの範囲（j≦D≦k）対角が接するまで"}]
[null,null,null,null,null,null,null,null,null,null,null,null,"杭径：ｄ",{"$f":"P25","v":"台形上辺 ：a"},{"$f":"Q25","v":"台形底辺 ：b"},"高さ：H","影響円：D","α","β","角度:δ21","角度:δ22","角度:δ23","角度:δ24",null,"高さ:h21","高さ:h22",null,null,null,null,"杭径：ｄ",{"$f":"AH25","v":"台形上辺 ：a"},{"$f":"AI25","v":"台形底辺 ：b"},"高さ：H","影響円：D","α","β","角度:δ21","角度:δ22","角度:δ23","角度:δ24",null,"高さ:h21","高さ:h22",null,null,null,null,"杭径：ｄ",{"$f":"AZ25","v":"台形上辺 ：a"},{"$f":"BA25","v":"台形底辺 ：b"},"高さ：H","影響円：D","α","β","角度:δ21","角度:δ22","角度:δ23","角度:δ24",null,"高さ:h21","高さ:h22"]
[null,null,null,null,null,null,null,null,null,null,null,null,{"$f":"N26","v":1},{"$f":"P26","v":1},{"$f":"Q26","v":2.2999999999999998},{"$f":"P30","v":2.59},{"$f":"Q30","v":1.4531912770642861},{"$f":"$X$28","v":0},{"$f":"$Y$28","v":3.1415926535897931},{"$f":"ACOS(M37/Q37)","v":0.81187296904977169},{"$f":"ACOS(O37/Q37)","v":{"$error":"#NUM!"}},{"$f":"S37-T37","v":2.3297196845400214},{"$f":"R37-U37","v":{"$error":"#NUM!"}},null,{"$f":"M37/2*TAN(T37)","v":0.52720131063373943},{"$f":"O37/2*TAN(U37)","v":{"$error":"#NUM!"}},null,null,null,null,{"$f":"AF26","v":1},{"$f":"AH26","v":1},{"$f":"AI26","v":2.2999999999999998},{"$f":"AH30","v":2.59},{"$f":"AI30","v":1.4531912770642861},{"$f":"$X$28","v":0},{"$f":"$Y$28","v":3.1415926535897931},{"$f":"ACOS(AE37/AI37)","v":0.81187296904977169},{"$f":"AJ37-AN37","v":-1.1070616976553664},{"$f":"ACOS(AR26/AI37)","v":1.1070616976553664},{"$f":"AK37-AL37-AN37","v":1.222657986884655},null,{"$f":"AE37/2*TAN(AL37)","v":0.52720131063373943},{"$f":"AR26/2*TAN(AN37)","v":0.64985861688057378},null,null,null,null,{"$f":"AX26","v":1},{"$f":"AZ26","v":1},{"$f":"BA26","v":2.2999999999999998},{"$f":"AZ30","v":2.59},{"$f":"BA30","v":1.4531912770642861},{"$f":"$X$28","v":0},{"$f":"$Y$28","v":3.1415926535897931},{"$f":"ACOS(AW37/BA37)","v":0.81187296904977169},{"$f":"BB37-BF37","v":-1.1070616976553664},{"$f":"ACOS(BJ26/BA37)","v":1.1070616976553664},{"$f":"BC37-BD37-BF37","v":1.222657986884655},null,{"$f":"AW37/2*TAN(BD37)","v":0.52720131063373943},{"$f":"BJ26/2*TAN(BF37)","v":0.64985861688057378}]
[null,null,null,null,null,null,null,null,null,null,null,null,null,null,null,null,null,"面積:A21","面積:A22","面積:A23","面積:A24",null,null,null,null,"台形面積","面積A2",null,null,null,null,null,null,null,null,"面積:A21","面積:A22","面積:A23","面積:A24",null,null,null,null,"台形面積","面積A2",null,null,null,null,null,null,null,null,"面積:A21","面積:A22","面積:A23","面積:A24",null,null,null,null,"台形面積","面積A2"]
[null,null,null,null,null,null,null,null,null,null,null,null,null,null,null,null,null,{"$f":"V37*Q37^2/8","v":0.61497752850979748},{"$f":"(M37*Y37)/2","v":0.26360065531686971},{"$f":"W37*Q37^2/8","v":{"$error":"#NUM!"}},{"$f":"O37*Z37/2","v":{"$error":"#NUM!"}},null,null,null,null,{"$f":"V26","v":0},{"$f":"Z39-(2*R39+S39+2*T39+U39)","v":{"$error":"#NUM!"}},null,null,null,null,null,null,null,null,{"$f":"AO37*AI37^2/8","v":0.32274577580158348},{"$f":"(AE37*AQ37)/2","v":0.26360065531686971},{"$f":"AM37*AI37^2/8","v":-0.29223175270821405},{"$f":"AR26*AR37/2","v":0.21120405048618646},null,null,null,null,{"$f":"AN26","v":0},{"$f":"AR39-(2*AJ39+AK39+2*AL39+2*AM39)","v":-0.74703680247598148},null,null,null,null,null,null,null,null,{"$f":"BG37*BA37^2/8","v":0.32274577580158348},{"$f":"(AW37*BI37)/2","v":0.26360065531686971},{"$f":"BE37*BA37^2/8","v":-0.29223175270821405},{"$f":"BJ26*BJ37/2","v":0.21120405048618646},null,null,null,null,{"$f":"BF26","v":0},{"$f":"BJ39-(2*BB39+BC39+2*BD39+2*BE39)","v":-0.74703680247598148}]
[null,null,null,null,null,null,null,null,null,null,null,null,{"$f":"U21","v":"STEP-3影響円Dの範囲（j≦D≦k）対角が接するまで"},null,null,null,null,null,null,null,null,null,null,null,null,null,null,null,null,null,{"$f":"AM21","v":"STEP-3影響円Dの範囲（b≦D≦k）対角が接するまで"},null,null,null,null,null,null,null,null,null,null,null,null,null,null,null,null,null,{"$f":"BE21","v":"STEP-3影響円Dの範囲（k≦D≦b）左右が接するまで"}]
[null,null,null,null,null,null,null,null,null,null,null,null,"杭径：ｄ",{"$f":"P25","v":"台形上辺 ：a"},{"$f":"Q25","v":"台形底辺 ：b"},"高さ：H","影響円：D","α","β","角度:δ31","角度:δ32","角度:δ33","角度:δ34","角度:δ35","ｈ3-1","ｈ3-2","ｈ3-3",null,null,null,"杭径：ｄ",{"$f":"AH25","v":"台形上辺 ：a"},{"$f":"AI25","v":"台形底辺 ：b"},"高さ：H","影響円：D","α","β","角度:δ31","角度:δ32","角度:δ33","角度:δ34","角度:δ35","ｈ3-1","ｈ3-2","ｈ3-3",null,null,null,"杭径：ｄ",{"$f":"AZ25","v":"台形上辺 ：a"},{"$f":"BA25","v":"台形底辺 ：b"},"高さ：H","影響円：D","α","β","角度:δ31","角度:δ32","角度:δ33","角度:δ34","角度:δ35","ｈ3-1","ｈ3-2","ｈ3-3"]
[null,null,null,null,null,null,null,null,null,null,null,null,{"$f":"N26","v":1},{"$f":"P26","v":1},{"$f":"O34","v":2.2999999999999998},{"$f":"Z23","v":2.59},{"$f":"Q30","v":1.4531912770642861},{"$f":"$X$28","v":0},{"$f":"$Y$28","v":3.1415926535897931},{"$f":"ACOS(M42/Q42)","v":0.81187296904977169},{"$f":"ACOS(O42/Q42)","v":{"$error":"#NUM!"}},{"$f":"ACOS(Z26/Q42)","v":1.1070616976553664},{"$f":"R42-U42-V42","v":{"$error":"#NUM!"}},{"$f":"S42-T42-V42","v":1.222657986884655},{"$f":"M42/2*TAN(T42)","v":0.52720131063373943},{"$f":"O42/2*TAN(U42)","v":{"$error":"#NUM!"}},{"$f":"Z26/2*TAN(V42)","v":0.64985861688057378},null,null,null,{"$f":"AF26","v":1},{"$f":"AH26","v":1},{"$f":"AG34","v":2.2999999999999998},{"$f":"AH30","v":2.59},{"$f":"AI30","v":1.4531912770642861},{"$f":"$X$28","v":0},{"$f":"$Y$28","v":3.1415926535897931},{"$f":"ACOS(AE42/AI42)","v":0.81187296904977169},{"$f":"ACOS(AG42/AI42)","v":{"$error":"#NUM!"}},{"$f":"ACOS(AR26/AI42)","v":1.1070616976553664},{"$f":"AJ42-AM42-AN42","v":{"$error":"#NUM!"}},{"$f":"AK42-AL42-AN42","v":1.222657986884655},{"$f":"AE42/2*TAN(AL42)","v":0.52720131063373943},{"$f":"AG42/2*TAN(AM42)","v":{"$error":"#NUM!"}},{"$f":"AR26/2*TAN(AN42)","v":0.64985861688057378},null,null,null,{"$f":"AX26","v":1},{"$f":"AZ26","v":1},{"$f":"AY34","v":2.2999999999999998},{"$f":"AZ30","v":2.59},{"$f":"BA30","v":1.4531912770642861},{"$f":"$X$28","v":0},{"$f":"$Y$28","v":3.1415926535897931},{"$f":"ACOS(AW42/BA42)","v":0.81187296904977169},{"$f":"BB42-BF42","v":-1.1070616976553664},{"$f":"ACOS(AW44/BA42)","v":1.1070616976553664},{"$f":"BC42-BD42-BF42","v":1.222657986884655},null,{"$f":"AW42/2*TAN(BD42)","v":0.52720131063373943},{"$f":"AW44/2*TAN(BF42)","v":0.64985861688057378}]
[null,null,null,null,null,null,null,null,null,null,null,null,{"$f":"Z25","v":"接円距離：j"},null,null,null,null,"A3-1","A3-2","A3-3","A3-4","A3-5",null,null,null,"台形面積","面積A3",null,null,null,null,null,null,null,null,"A3-1","A3-2","A3-3","A3-4","A3-5",null,null,null,"台形面積","面積A3",null,null,null,{"$f":"BJ25","v":"接円距離：j"},null,null,null,null,"A3-1","A3-2","A3-3","A3-4","A3-5",null,null,null,"台形面積","面積A3"]
[{"$f":"U5","v":"STEP-0：底面積（d=D）"},null,null,null,null,null,null,null,null,null,null,null,{"$f":"Z26","v":0.64999999999999991},null,null,null,null,{"$f":"X42*Q42^2/8","v":0.32274577580158348},{"$f":"M42*Y42/2","v":0.26360065531686971},{"$f":"W42*Q42^2/8","v":{"$error":"#NUM!"}},{"$f":"O42*Z42/2","v":{"$error":"#NUM!"}},{"$f":"Z26*AA42/2","v":0.21120405048618646},null,null,null,{"$f":"V26","v":0},{"$f":"Z44-(2*R44+S44+2*T44+U44+2*V44)","v":{"$error":"#NUM!"}},null,null,null,null,null,null,null,null,{"$f":"AP42*AI42^2/8","v":0.32274577580158348},{"$f":"AE42*AQ42/2","v":0.26360065531686971},{"$f":"AO42*AI42^2/8","v":{"$error":"#NUM!"}},{"$f":"AG42*AR42/2","v":{"$error":"#NUM!"}},{"$f":"AR26*AS42/2","v":0.21120405048618646},null,null,null,{"$f":"AN26","v":0},{"$f":"AR44-(2*AJ44+AK44+2*AL44+AM44+2*AN44)","v":{"$error":"#NUM!"}},null,null,null,{"$f":"BJ26","v":0.64999999999999991},null,null,null,null,{"$f":"BG42*BA42^2/8","v":0.32274577580158348},{"$f":"AW42*BI42/2","v":0.26360065531686971},{"$f":"BE42*BA42^2/8","v":-0.29223175270821405},{"$f":"AW44*BJ42/2","v":0.21120405048618646},null,null,null,null,{"$f":"BF26","v":0},{"$f":"BJ44-(2*BB44+BC44+2*BD44+2*BE44)","v":-0.74703680247598148}]
[null,null,null,null,null,null,null,null,null,null,null,null,"STEP-4：(2r)が接するまで",null,null,null,null,null,null,null,null,null,null,null,null,null,null,null,null,null,"STEP-4：(2r)が接するまで",null,null,null,null,null,null,null,null,null,null,null,null,null,null,null,null,null,"STEP-4：(2r)が接するまで"]
[null,"項目","杭径：ｄ","杭面積","台形上辺 ：a","台形底辺 ：b","分担面横：L","分担面縦：h","面積：Lh","改良率",null,null,"杭径：ｄ",{"$f":"P25","v":"台形上辺 ：a"},{"$f":"Q25","v":"台形底辺 ：b"},"高さ：H","影響円：D","α","β","角度:δ41","角度:δ42","角度:δ43","角度:δ44","角度:δ45","ｈ4-1","ｈ4-2","ｈ4-3",null,null,null,"杭径：ｄ",{"$f":"AH30","v":2.59},{"$f":"AI30","v":1.4531912770642861},"高さ：H","影響円：D","α","β","角度:δ41","角度:δ42","角度:δ43","角度:δ44","角度:δ45","ｈ4-1","ｈ4-2","ｈ4-3",null,null,null,"杭径：ｄ",{"$f":"AZ25","v":"台形上辺 ：a"},{"$f":"BA25","v":"台形底辺 ：b"},"高さ：H","影響円：D","α","β","角度:δ41","角度:δ42","角度:δ43","角度:δ44","角度:δ45","ｈ4-1","ｈ4-2","ｈ4-3"]
[null,"数値",{"$f":"F3","v":1},{"$f":"PI()*C47^2/4","v":0.78539816339744828},{"$f":"F4","v":1},{"$f":"F5","v":2.2999999999999998},{"$f":"F6","v":""},{"$f":"F7","v":0},{"$f":"G47*H47","v":{"$error":"#VALUE!"}},{"$f":"(D47*2/I47)","v":{"$error":"#VALUE!"}},null,null,{"$f":"M42","v":1},{"$f":"N42","v":1},{"$f":"O42","v":2.2999999999999998},{"$f":"Z23","v":2.59},{"$f":"Q30","v":1.4531912770642861},{"$f":"$X$28","v":0},{"$f":"$Y$28","v":3.1415926535897931},{"$f":"ACOS(M47/Q47)","v":0.81187296904977169},{"$f":"ACOS(O47/Q47)","v":{"$error":"#NUM!"}},{"$f":"ACOS(Z26/Q47)","v":1.1070616976553664},{"$f":"R47-U47-V47","v":{"$error":"#NUM!"}},{"$f":"S47-T47-V47","v":1.222657986884655},{"$f":"M47/2*TAN(T47)","v":0.52720131063373943},{"$f":"O47/2*TAN(U47)","v":{"$error":"#NUM!"}},{"$f":"Z26/2*TAN(V47)","v":0.64985861688057378},null,null,null,{"$f":"AE42","v":1},{"$f":"AF42","v":1},{"$f":"AG42","v":2.2999999999999998},{"$f":"AR23","v":0},{"$f":"AI30","v":1.4531912770642861},{"$f":"$X$28","v":0},{"$f":"$Y$28","v":3.1415926535897931},{"$f":"ACOS(AE47/AI47)","v":0.81187296904977169},{"$f":"ACOS(AG47/AI47)","v":{"$error":"#NUM!"}},{"$f":"ACOS(AR26/AI47)","v":1.1070616976553664},{"$f":"AJ47-AM47-AN47","v":{"$error":"#NUM!"}},{"$f":"AK47-AL47-AN47","v":1.222657986884655},{"$f":"AE47/2*TAN(AL47)","v":0.52720131063373943},{"$f":"AG47/2*TAN(AM47)","v":{"$error":"#NUM!"}},{"$f":"AR26/2*TAN(AN47)","v":0.64985861688057378},null,null,null,{"$f":"AW42","v":1},{"$f":"AX42","v":1},{"$f":"AY42","v":2.2999999999999998},{"$f":"AZ30","v":2.59},{"$f":"BA30","v":1.4531912770642861},{"$f":"$X$28","v":0},{"$f":"$Y$28","v":3.1415926535897931},{"$f":"ACOS(AW47/BA47)","v":0.81187296904977169},{"$f":"ACOS(AY47/BA47)","v":{"$error":"#NUM!"}},{"$f":"ACOS(BJ26/BA47)","v":1.1070616976553664},{"$f":"BB47-BE47-BF47","v":{"$error":"#NUM!"}},{"$f":"BC47-BD47-BF47","v":1.222657986884655},{"$f":"AW47/2*TAN(BD47)","v":0.52720131063373943},{"$f":"AY47/2*TAN(BE47)","v":{"$error":"#NUM!"}},{"$f":"BJ26/2*TAN(BF47)","v":0.64985861688057378}]
[null,null,null,null,null,null,null,null,null,null,null,null,null,null,null,null,null,"A4-1","A4-2","A4-3","A4-4","A4-5",null,null,null,"台形面積","面積A4",null,null,null,null,null,null,null,null,"A4-1","A4-2","A4-3","A4-4","A4-5",null,null,null,"台形面積","面積A4",null,null,null,null,null,null,null,null,"A4-1","A4-2","A4-3","A4-4","A4-5",null,null,null,"台形面積","面積A4"]
[null,{"$f":"A44","v":"STEP-0：底面積（d=D）"},null,null,null,null,null,null,null,null,null,null,null,null,null,null,null,{"$f":"X47*Q47^2/8","v":0.32274577580158348},{"$f":"M47*Y47/2","v":0.26360065531686971},{"$f":"W47*Q47^2/8","v":{"$error":"#NUM!"}},{"$f":"O47*Z47/2","v":{"$error":"#NUM!"}},{"$f":"Z26*AA47/2","v":0.21120405048618646},null,null,null,{"$f":"V26","v":0},{"$f":"Z49-(2*R49+S49+2*T49+U49+2*V49)","v":{"$error":"#NUM!"}},null,null,null,null,null,null,null,null,{"$f":"AP47*AI47^2/8","v":0.32274577580158348},{"$f":"AE47*AQ47/2","v":0.26360065531686971},{"$f":"AO47*AI47^2/8","v":{"$error":"#NUM!"}},{"$f":"AG47*AR47/2","v":{"$error":"#NUM!"}},{"$f":"AR26*AS47/2","v":0.21120405048618646},null,null,null,{"$f":"AN26","v":0},{"$f":"AR49-(2*AJ49+AK49+2*AL49+AM49+2*AN49)","v":{"$error":"#NUM!"}},null,null,null,null,null,null,null,null,{"$f":"BH47*BA47^2/8","v":0.32274577580158348},{"$f":"AW47*BI47/2","v":0.26360065531686971},{"$f":"BG47*BA47^2/8","v":{"$error":"#NUM!"}},{"$f":"AY47*BJ47/2","v":{"$error":"#NUM!"}},{"$f":"BJ26*BK47/2","v":0.21120405048618646},null,null,null,{"$f":"BF26","v":0},{"$f":"BJ49-(2*BB49+BC49+2*BD49+BE49+2*BF49)","v":{"$error":"#NUM!"}}]
[]
[]
[]
[]
[]
[]
[]
[]
[]
[]
[]
[]
[]
[]
[]
[null,"塑性角：θ","ラジアン","高さ：H","影響円：D","（d+b）*h/2",{"$f":"D46","v":"杭面積"},"面積A0"]
[null,{"$f":"F13","v":85},{"$f":"RADIANS(B66)","v":1.4835298641951802},{"$f":"E17","v":1.59375},{"$f":"$C$47+2*D66/TAN($C$66)","v":1.2788701149888826},{"$f":"(E47+F47)/2*H47","v":0},{"$f":"D47","v":0.78539816339744828},{"$f":"F66-D47","v":-0.78539816339744828}]
[]
[]
[]
[]
[]
[]
[]
[]
[]
[]
[]
[]
[]
[]
[]
[]
[]
[]
[]
[]
[{"$f":"U6","v":{"$error":"#DIV/0!"}}]
[]
[null,"杭径：ｄ","長辺：a",{"$f":"F46","v":"台形底辺 ：b"},"高さ：H","影響円：D","角度:δ1","α","β","高さ:h1"]
[null,{"$f":"C47","v":1},{"$f":"E47","v":1},{"$f":"F47","v":2.2999999999999998},{"$f":"E18","v":{"$error":"#DIV/0!"}},{"$f":"$C$47+2*E90/TAN($C$66)","v":{"$error":"#DIV/0!"}},{"$f":"ACOS(B90/F90)","v":{"$error":"#DIV/0!"}},{"$f":"$X$28","v":0},{"$f":"$Y$28","v":3.1415926535897931},{"$f":"B90/2*TAN(G90)","v":{"$error":"#DIV/0!"}}]
[]
[null,{"$f":"A87","v":{"$error":"#DIV/0!"}}]
[]
[]
[]
[]
[]
[]
[]
[]
[]
[]
[]
[]
[]
[]
[]
[null,"A1-1","A1-2","A1-3","台形面積A00","面積A1"]
[null,{"$f":"(I90-G90)*F90^2/8","v":{"$error":"#DIV/0!"}},{"$f":"B90*J90/2","v":{"$error":"#DIV/0!"}},{"$f":"H90*F90^2/8","v":{"$error":"#DIV/0!"}},{"$f":"$V$26","v":0},{"$f":"E109-(2*B109+C109+2*D109)","v":{"$error":"#DIV/0!"}}]
[]
[]
[]
[]
[]
[]
[]
[]
[]
[]
[]
[]
[]
[]
[]
[]
[]
[]
[]
[]
[{"$f":"U7","v":{"$error":"#DIV/0!"}}]
[]
[null,"杭径：ｄ",{"$f":"E46","v":"台形上辺 ：a"},{"$f":"D89","v":"台形底辺 ：b"},"高さ：H","影響円：D","α","角度:δ21","角度:δ23","高さ:h21"]
[null,{"$f":"F3","v":1},{"$f":"E47","v":1},{"$f":"D90","v":2.2999999999999998},{"$f":"E19","v":{"$error":"#DIV/0!"}},{"$f":"$C$47+2*E133/TAN($C$66)","v":{"$error":"#DIV/0!"}},{"$f":"$X$28","v":0},{"$f":"ACOS(B133/F133)","v":{"$error":"#DIV/0!"}},{"$f":"ACOS(B135/F133)","v":{"$error":"#DIV/0!"}},{"$f":"B133/2*TAN(H133)","v":{"$error":"#DIV/0!"}}]
[null,"接円距離：j","対角距離：k",null,null,null,"β","角度:δ22","角度:δ24","高さ:h22"]
[null,{"$f":"Z26","v":0.64999999999999991},{"$f":"AA26","v":1.65},null,null,null,{"$f":"$Y$28","v":3.1415926535897931},{"$f":"G133-I133","v":{"$error":"#DIV/0!"}},{"$f":"G135-H133-I133","v":{"$error":"#DIV/0!"}},{"$f":"B135/2*TAN(I133)","v":{"$error":"#DIV/0!"}}]
[null,{"$f":"A130","v":{"$error":"#DIV/0!"}}]
[]
[]
[]
[]
[]
[]
[]
[]
[]
[]
[]
[]
[]
[]
[null,"面積:A21","面積:A22","面積:A23","面積:A24","台形面積A00","面積A2"]
[null,{"$f":"I135*F133^2/8","v":{"$error":"#DIV/0!"}},{"$f":"(B133*J133)/2","v":{"$error":"#DIV/0!"}},{"$f":"H135*F133^2/8","v":{"$error":"#DIV/0!"}},{"$f":"B135*J135/2","v":{"$error":"#DIV/0!"}},{"$f":"$V$26","v":0},{"$f":"F152-(2*B152+C152+2*D152+2*E152)","v":{"$error":"#DIV/0!"}}]
[]
[]
[]
[]
[]
[]
[]
[]
[]
[]
[]
[]
[]
[]
[]
[]
[]
[]
[]
[]
[{"$f":"U8","v":{"$error":"#DIV/0!"}}]
[]
[null,"杭径：ｄ","長辺：a","短辺：ｂ","高さ：H","影響円：D","α","角度:δ21","角度:δ23","高さ:h21"]
[null,{"$f":"F3","v":1},{"$f":"P26","v":1},{"$f":"Q26","v":2.2999999999999998},{"$f":"E20","v":{"$error":"#DIV/0!"}},{"$f":"$C$47+2*E176/TAN($C$66)","v":{"$error":"#DIV/0!"}},{"$f":"$X$28","v":0},{"$f":"ACOS(B176/F176)","v":{"$error":"#DIV/0!"}},{"$f":"ACOS(B178/F176)","v":{"$error":"#DIV/0!"}},{"$f":"B176/2*TAN(H176)","v":{"$error":"#DIV/0!"}}]
[null,"接円距離：j","対角距離：k",null,null,null,"β","角度:δ22","角度:δ24","高さ:h22"]
[null,{"$f":"Z26","v":0.64999999999999991},{"$f":"AA26","v":1.65},null,null,null,{"$f":"$Y$28","v":3.1415926535897931},{"$f":"G176-I176","v":{"$error":"#DIV/0!"}},{"$f":"G178-H176-I176","v":{"$error":"#DIV/0!"}},{"$f":"B178/2*TAN(I176)","v":{"$error":"#DIV/0!"}}]
[]
[null,{"$f":"A173","v":{"$error":"#DIV/0!"}}]
[]
[]
[]
[]
[]
[]
[]
[]
[]
[]
[]
[]
[]
[null,"A3-1","A3-2","A3-3","A3-4","A3-5","台形面積A00","面積A3"]
[null,{"$f":"I178*F176^2/8","v":{"$error":"#DIV/0!"}},{"$f":"(B176*J176)/2","v":{"$error":"#DIV/0!"}},{"$f":"H178*F176^2/8","v":{"$error":"#DIV/0!"}},{"$f":"B178*J178/2","v":{"$error":"#DIV/0!"}},null,{"$f":"$V$26","v":0},{"$f":"G195-(2*B195+C195+2*D195+2*E195)","v":{"$error":"#DIV/0!"}}]
[]
[]
[]
[]
[]
[]
[]
[]
[]
[]
[]
[]
[]
[]
[]
[]
[]
[]
[]
[null,null,null,null,null,null,null,null,null,null,"＊"]
[{"$f":"U9","v":{"$error":"#DIV/0!"}},null,null,null,null,null,null,null,null,null,null,null,null,null,"x","y","x","y"]
[null,null,null,null,null,null,null,null,null,null,null,null,null,"座標1",0,0,0,0]
[null,{"$f":"E46","v":"台形上辺 ：a"},{"$f":"F46","v":"台形底辺 ：b"},"高さ：H","影響円：D","α","β","角度:δ41","角度:δ42","角度:δ43",null,null,null,"座標2","(b-d)/2","-ｈ",{"$f":"(C219-B221)/2","v":0.64999999999999991},{"$f":"-H47","v":0}]
[null,{"$f":"C176","v":1},{"$f":"D176","v":2.2999999999999998},{"$f":"E21","v":{"$error":"#DIV/0!"}},{"$f":"$C$47+2*D219/TAN($C$66)","v":{"$error":"#DIV/0!"}},{"$f":"$X$28","v":0},{"$f":"$Y$28","v":3.1415926535897931},{"$f":"ACOS(B221/E219)","v":{"$error":"#DIV/0!"}},{"$f":"ACOS(C219/E219)","v":{"$error":"#DIV/0!"}},{"$f":"ACOS(C221/E219)","v":{"$error":"#DIV/0!"}},null,null,null,"座標3","b",0,{"$f":"C219","v":2.2999999999999998},0]
[null,"杭径：ｄ","対角距離：j","対角距離：k","2r","角度:δ44","角度:δ45","ｈ4-1","ｈ4-2","ｈ4-3"]
[null,{"$f":"F3","v":1},{"$f":"Z26","v":0.64999999999999991},{"$f":"AA26","v":1.65},{"$f":"2*O227","v":{"$error":"#DIV/0!"}},{"$f":"F219-I219-J219","v":{"$error":"#DIV/0!"}},{"$f":"G219-H219-J219","v":{"$error":"#DIV/0!"}},{"$f":"B221/2*TAN(H219)","v":{"$error":"#DIV/0!"}},{"$f":"C219/2*TAN(I219)","v":{"$error":"#DIV/0!"}},{"$f":"C221/2*TAN(J219)","v":{"$error":"#DIV/0!"}},null,null,null,"分子",{"$f":"(R217-R218)*(Q219^2-Q217^2+R219^2-R217^2)","v":0},{"$f":"-1*(R219-R217)*(Q218^2-Q217^2+R218^2-R217^2)","v":0},{"$f":"O221+P221","v":0},"中心xp"]
[null,null,null,null,null,null,null,null,null,null,null,null,null,"分母",{"$f":"2*(Q217-Q218)*(R217-R219)","v":0},{"$f":"-2*(Q217-Q219)*(R217-R218)","v":0},{"$f":"O222+P222","v":0},{"$f":"Q221/Q222","v":{"$error":"#DIV/0!"}}]
[null,{"$f":"A216","v":{"$error":"#DIV/0!"}}]
[null,null,null,null,null,null,null,null,null,null,null,null,null,"分子",{"$f":"(Q217-Q219)*(Q218^2-Q217^2+R218^2-R217^2)","v":-0.97174999999999967},{"$f":"-(Q217-Q218)*(Q219^2-Q217^2+R219^2-R217^2)","v":3.438499999999999},{"$f":"O224+P224","v":2.4667499999999993},"中心yp"]
[null,null,null,null,null,null,null,null,null,null,null,null,null,"分母",{"$f":"2*(Q217-Q218)*(R217-R219)","v":0},{"$f":"-2*(Q217-Q219)*(R217-R218)","v":0},{"$f":"O225+P225","v":0},{"$f":"Q224/Q225","v":{"$error":"#DIV/0!"}}]
[]
[null,null,null,null,null,null,null,null,null,null,null,null,null,"r=",{"$f":"SQRT(R222^2+R225^2)","v":{"$error":"#DIV/0!"}}]
[]
[]
[]
[]
[]
[]
[]
[]
[]
[null,"A4-1","A4-2","A4-3","A4-4","A4-5","台形面積A00","面積A4"]
[null,{"$f":"G221*E219^2/8","v":{"$error":"#DIV/0!"}},{"$f":"B221*H221/2","v":{"$error":"#DIV/0!"}},{"$f":"F221*E219^2/8","v":{"$error":"#DIV/0!"}},{"$f":"C219*I221/2","v":{"$error":"#DIV/0!"}},{"$f":"C221*J221/2","v":{"$error":"#DIV/0!"}},{"$f":"$V$26","v":0},{"$f":"G238-(2*B238+C238+2*D238+E238+2*F238)","v":{"$error":"#DIV/0!"}}]
[]
[]
[]
[]
[]
[]
[]
[]
[]
[]
[]
[]
[]
[]
[]
[]
[]
[]
[]
[null,null,null,null,null,null,null,null,null,null,"＊"]

{"sheet":"画像","index":7,"n_rows":12,"n_cols":2,"rows_kept":12,"cut":false,"hidden":false,"merged":[[0,0,9,9],[0,10,9,19],[0,20,9,29],[0,30,9,39]]}
[]
[]
[]
[]
[]
[]
[]
[]
[]
[]
["⇧セルの結合を外さない！！！！！"]
[null,"セルの範囲の中の画像を張り替えると図を差し替えられる。"]